BDBM54981 (4Z)-2-(3,4-dimethylphenyl)-5-methyl-4-[(E)-3-(5-nitro-2-furanyl)prop-2-enylidene]-3-pyrazolone::(4Z)-2-(3,4-dimethylphenyl)-5-methyl-4-[(E)-3-(5-nitro-2-furyl)prop-2-enylidene]-2-pyrazolin-3-one::(4Z)-2-(3,4-dimethylphenyl)-5-methyl-4-[(E)-3-(5-nitrofuran-2-yl)prop-2-enylidene]pyrazol-3-one::MLS000856133::SMR000282878::cid_5760042
SMILES Cc1[n-]n(-c2ccc(C)c(C)c2)c(=O)c1[CH+]\C=C\c1ccc(o1)[N+]([O-])=O
InChI Key InChIKey=AZSPGBSZEXCRDJ-SNAWJCMRSA-N
Data  1 IC50
  Tab Delimited (TSV)   2D SDfile   Computed 3D by Vconf -m prep SDfile
Find this compound or compounds like it in BindingDB:
Activity Spreadsheet -- Enzyme Inhibition Constant Data from BindingDB
Found 1 hit for monomerid = 54981
TargetCore protein(Hepatitis C virus)
The Scripps Research Institute Molecular Screening Center
Curated by PubChem BioAssay
LigandPNGBDBM54981((4Z)-2-(3,4-dimethylphenyl)-5-methyl-4-[(E)-3-(5-n...)
Affinity DataIC50: >4.98E+4nM. Assay description: Source (MLPCN Center Name): The Scripps Research Institute Molecular Screening Center Affiliation: The Scripps Research Institute, TSRI Assay Provide...
Ligand InfoPC cidPC sid
In DepthDetails PCBioAssay