BDBM54994 2-(4-methylphenoxy)-N-[5-(4-methylpiperidin-1-yl)sulfonyl-1,3,4-thiadiazol-2-yl]acetamide::2-(4-methylphenoxy)-N-[5-(4-methylpiperidin-1-yl)sulfonyl-1,3,4-thiadiazol-2-yl]ethanamide::2-(4-methylphenoxy)-N-[5-(4-methylpiperidino)sulfonyl-1,3,4-thiadiazol-2-yl]acetamide::2-(4-methylphenoxy)-N-[5-[(4-methyl-1-piperidinyl)sulfonyl]-1,3,4-thiadiazol-2-yl]acetamide::MLS001115539::SMR000626508::cid_22517542
SMILES CC1CCN(CC1)S(=O)(=O)c1nnc(NC(=O)COc2ccc(C)cc2)s1
InChI Key InChIKey=XUBHMWVIPQWGFI-UHFFFAOYSA-N
Data  1 IC50
  Tab Delimited (TSV)   2D SDfile   Computed 3D by Vconf -m prep SDfile
Find this compound or compounds like it in BindingDB:
Activity Spreadsheet -- Enzyme Inhibition Constant Data from BindingDB
Found 1 hit for monomerid = 54994
TargetCore protein(Hepatitis C virus)
The Scripps Research Institute Molecular Screening Center
Curated by PubChem BioAssay
LigandPNGBDBM54994(2-(4-methylphenoxy)-N-[5-(4-methylpiperidin-1-yl)s...)
Affinity DataIC50: >4.98E+4nM. Assay description: Source (MLPCN Center Name): The Scripps Research Institute Molecular Screening Center Affiliation: The Scripps Research Institute, TSRI Assay Provide...
In DepthDetails PCBioAssay