BDBM55029 Furan-2-carboxylic acid benzyl-(3-furan-2-yl-3-p-tolyl-propyl)-amide::MLS000587345::N-[3-(2-furanyl)-3-(4-methylphenyl)propyl]-N-(phenylmethyl)-2-furancarboxamide::N-[3-(furan-2-yl)-3-(4-methylphenyl)propyl]-N-(phenylmethyl)furan-2-carboxamide::N-benzyl-N-[3-(2-furyl)-3-(p-tolyl)propyl]-2-furamide::N-benzyl-N-[3-(furan-2-yl)-3-(4-methylphenyl)propyl]furan-2-carboxamide::SMR000211435::cid_3833044
SMILES Cc1ccc(cc1)C(CCN(Cc1ccccc1)C(=O)c1ccco1)c1ccco1
InChI Key InChIKey=OAEKNZSEPMUQQW-UHFFFAOYSA-N
Data  3 IC50
  Tab Delimited (TSV)   2D SDfile   Computed 3D by Vconf -m prep SDfile
Find this compound or compounds like it in BindingDB:
Activity Spreadsheet -- Enzyme Inhibition Constant Data from BindingDB
Found 3 hits for monomerid = 55029
TargetGenome polyprotein(Hepatitis C virus)
The Scripps Research Institute Molecular Screening Center
Curated by PubChem BioAssay
LigandPNGBDBM55029(Furan-2-carboxylic acid benzyl-(3-furan-2-yl-3-p-t...)
Affinity DataIC50:  8.82E+3nM. Assay description: Source (MLPCN Center Name): The Scripps Research Institute Molecular Screening Center (SRIMSC) Center Affiliation: The Scripps Research Institute (TS...
In DepthDetails PCBioAssay
TargetC-C chemokine receptor type 6(Homo sapiens (Human))
Burnham Center For Chemical Genomics
Curated by PubChem BioAssay
LigandPNGBDBM55029(Furan-2-carboxylic acid benzyl-(3-furan-2-yl-3-p-t...)
Affinity DataIC50: >6.66E+4nM. Assay description: Data Source: Sanford-Burnham Center for Chemical Genomics (SBCCG) Source Affiliation: Sanford-Burnham Medical Research Institute(SBMRI, San Diego, CA...
In DepthDetails PCBioAssay
TargetBeta-galactosidase(Escherichia coli)
Burnham Center For Chemical Genomics
Curated by PubChem BioAssay
LigandPNGBDBM55029(Furan-2-carboxylic acid benzyl-(3-furan-2-yl-3-p-t...)
Affinity DataIC50: >6.66E+4nM. Assay description: Data Source: Sanford-Burnham Center for Chemical Genomics (SBCCG) Source Affiliation: Sanford-Burnham Medical Research Institute(SBMRI, San Diego, C...
In DepthDetails PCBioAssay