BDBM55040 1-(6-methylpyridin-2-yl)-4-oxidanyl-2-(4-propan-2-ylphenyl)-3-thiophen-2-ylcarbonyl-2H-pyrrol-5-one::3-Hydroxy-5-(4-isopropyl-phenyl)-1-(6-methyl-pyridin-2-yl)-4-(thiophene-2-carbonyl)-1,5-dihydro-pyrrol-2 -one::3-hydroxy-1-(6-methyl-2-pyridyl)-5-p-cumenyl-4-(2-thenoyl)-3-pyrrolin-2-one::4-hydroxy-1-(6-methyl-2-pyridinyl)-3-[oxo(thiophen-2-yl)methyl]-2-(4-propan-2-ylphenyl)-2H-pyrrol-5-one::4-hydroxy-1-(6-methylpyridin-2-yl)-2-(4-propan-2-ylphenyl)-3-(thiophene-2-carbonyl)-2H-pyrrol-5-one::MLS001029611::SMR000425059::cid_3771682
SMILES CC(C)c1ccc(cc1)C1C(C(=O)c2cccs2)C(=O)C(=O)N1c1cccc(C)n1
InChI Key InChIKey=ZEXNMZNYWXCPIN-UHFFFAOYSA-N
Data  1 IC50  2 EC50
  Tab Delimited (TSV)   2D SDfile   Computed 3D by Vconf -m prep SDfile
Find this compound or compounds like it in BindingDB:
Activity Spreadsheet -- Enzyme Inhibition Constant Data from BindingDB
Found 3 hits for monomerid = 55040
TargetGenome polyprotein(Hepatitis C virus)
The Scripps Research Institute Molecular Screening Center
Curated by PubChem BioAssay
LigandPNGBDBM55040(1-(6-methylpyridin-2-yl)-4-oxidanyl-2-(4-propan-2-...)
Affinity DataIC50:  5.88E+3nM. Assay description: Source (MLPCN Center Name): The Scripps Research Institute Molecular Screening Center (SRIMSC) Center Affiliation: The Scripps Research Institute (TS...
In DepthDetails PCBioAssay
TargetCorticotropin-releasing factor-binding protein(Homo sapiens (Human))
Burnham Center For Chemical Genomics
Curated by PubChem BioAssay
LigandPNGBDBM55040(1-(6-methylpyridin-2-yl)-4-oxidanyl-2-(4-propan-2-...)
Affinity DataEC50:  1.13E+4nM. Assay description: Data Source: Sanford-Burnham Center for Chemical Genomics (SBCCG) Source Affiliation: Sanford-Burnham Medical Research Institute (SBMRI, San Diego, C...
In DepthDetails PCBioAssay
TargetHeat shock factor protein 1(Mus musculus)
Broad Institute
Curated by PubChem BioAssay
LigandPNGBDBM55040(1-(6-methylpyridin-2-yl)-4-oxidanyl-2-(4-propan-2-...)
Affinity DataEC50: >2.60E+5nM. Assay description: Keywords: Heat Shock Factor-1 (HSF-1), Stress Response, MG132, NIH3T3, Luminescence Assay Overview: Confirmation testing of small molecules identifie...
In DepthDetails PCBioAssay