BDBM55056 (4Z)-4-[hydroxy-(3-methyl-4-propoxy-phenyl)methylene]-5-(4-methoxyphenyl)-1-(2-pyridyl)pyrrolidine-2,3-quinone::(4Z)-4-[hydroxy-(3-methyl-4-propoxyphenyl)methylidene]-5-(4-methoxyphenyl)-1-(2-pyridinyl)pyrrolidine-2,3-dione::(4Z)-4-[hydroxy-(3-methyl-4-propoxyphenyl)methylidene]-5-(4-methoxyphenyl)-1-pyridin-2-ylpyrrolidine-2,3-dione::(4Z)-5-(4-methoxyphenyl)-4-[(3-methyl-4-propoxy-phenyl)-oxidanyl-methylidene]-1-pyridin-2-yl-pyrrolidine-2,3-dione::3-hydroxy-5-(4-methoxyphenyl)-4-(3-methyl-4-propoxybenzoyl)-1-pyridin-2-yl-1,5-dihydro-2H-pyrrol-2-one::MLS001196665::SMR000556022::cid_23885215
SMILES CCCOc1ccc(cc1C)C(=O)C1C(N(C(=O)C1=O)c1ccccn1)c1ccc(OC)cc1
InChI Key InChIKey=MGQGRGWYVLHKHS-UHFFFAOYSA-N
Data  1 IC50  1 EC50
  Tab Delimited (TSV)   2D SDfile   Computed 3D by Vconf -m prep SDfile
Find this compound or compounds like it in BindingDB:
Activity Spreadsheet -- Enzyme Inhibition Constant Data from BindingDB
Found 2 hits for monomerid = 55056
TargetStreptokinase A(Streptococcus pyogenes M1 GAS)
Broad Institute
Curated by PubChem BioAssay
LigandPNGBDBM55056((4Z)-4-[hydroxy-(3-methyl-4-propoxy-phenyl)methyle...)
Affinity DataEC50:  1.03E+5nM. Assay description: Keywords: Group A streptococcus, GAS, streptokinase, expression, virulence, inhibition, dose response, EC50 Assay Overview: The goal of this assa...
In DepthDetails PCBioAssay
TargetGenome polyprotein(Hepatitis C virus)
The Scripps Research Institute Molecular Screening Center
Curated by PubChem BioAssay
LigandPNGBDBM55056((4Z)-4-[hydroxy-(3-methyl-4-propoxy-phenyl)methyle...)
Affinity DataIC50:  5.74E+3nM. Assay description: Source (MLPCN Center Name): The Scripps Research Institute Molecular Screening Center (SRIMSC) Center Affiliation: The Scripps Research Institute (TS...
In DepthDetails PCBioAssay