BDBM55064 3-(furan-2-carbonyl)-4-hydroxy-2-(4-hydroxyphenyl)-1-(6-methyl-1,3-benzothiazol-2-yl)-2H-pyrrol-5-one;oxalic acid::3-[2-furanyl(oxo)methyl]-4-hydroxy-2-(4-hydroxyphenyl)-1-(6-methyl-1,3-benzothiazol-2-yl)-2H-pyrrol-5-one;oxalic acid::4-(2-furoyl)-3-hydroxy-5-(4-hydroxyphenyl)-1-(6-methyl-1,3-benzothiazol-2-yl)-3-pyrrolin-2-one;oxalic acid::4-(Furan-2-carbonyl)-3-hydroxy-5-(4-hydroxy-phenyl)-1-(6-methyl-benzothiazol-2-yl)-1,5-dihydro-pyrrol-2-one::MLS001225329::SMR000612212::cid_24792466::ethanedioic acid;3-(furan-2-ylcarbonyl)-2-(4-hydroxyphenyl)-1-(6-methyl-1,3-benzothiazol-2-yl)-4-oxidanyl-2H-pyrrol-5-one
SMILES Cc1ccc2nc(sc2c1)N1C(C(C(=O)c2ccco2)C(=O)C1=O)c1ccc(O)cc1
InChI Key InChIKey=AVSFLBHYIZTNGY-UHFFFAOYSA-N
Data  1 IC50
  Tab Delimited (TSV)   2D SDfile   Computed 3D by Vconf -m prep SDfile
Find this compound or compounds like it in BindingDB:
Activity Spreadsheet -- Enzyme Inhibition Constant Data from BindingDB
Found 1 hit for monomerid = 55064
TargetGenome polyprotein(Hepatitis C virus)
The Scripps Research Institute Molecular Screening Center
Curated by PubChem BioAssay
LigandPNGBDBM55064(3-(furan-2-carbonyl)-4-hydroxy-2-(4-hydroxyphenyl)...)
Affinity DataIC50:  3.42E+3nM. Assay description: Source (MLPCN Center Name): The Scripps Research Institute Molecular Screening Center (SRIMSC) Center Affiliation: The Scripps Research Institute (TS...
In DepthDetails PCBioAssay