BDBM55076 3-(5-methylfuran-2-yl)carbonyl-1-(5-methyl-1,2-oxazol-3-yl)-4-oxidanyl-2-(3-phenoxyphenyl)-2H-pyrrol-5-one::3-hydroxy-4-(5-methyl-2-furoyl)-1-(5-methylisoxazol-3-yl)-5-(3-phenoxyphenyl)-3-pyrrolin-2-one::4-hydroxy-3-(5-methylfuran-2-carbonyl)-1-(5-methyl-1,2-oxazol-3-yl)-2-(3-phenoxyphenyl)-2H-pyrrol-5-one::4-hydroxy-3-[(5-methyl-2-furanyl)-oxomethyl]-1-(5-methyl-3-isoxazolyl)-2-(3-phenoxyphenyl)-2H-pyrrol-5-one::MLS001147816::SMR000646995::cid_3531704
SMILES Cc1ccc(o1)C(=O)C1C(N(C(=O)C1=O)c1cc(C)on1)c1cccc(Oc2ccccc2)c1
InChI Key InChIKey=UMAQAKLJAZMSSR-UHFFFAOYSA-N
Data  1 IC50
  Tab Delimited (TSV)   2D SDfile   Computed 3D by Vconf -m prep SDfile
Find this compound or compounds like it in BindingDB:
Activity Spreadsheet -- Enzyme Inhibition Constant Data from BindingDB
Found 1 hit for monomerid = 55076
TargetGenome polyprotein(Hepatitis C virus)
The Scripps Research Institute Molecular Screening Center
Curated by PubChem BioAssay
LigandPNGBDBM55076(3-(5-methylfuran-2-yl)carbonyl-1-(5-methyl-1,2-oxa...)
Affinity DataIC50:  1.95E+3nM. Assay description: Source (MLPCN Center Name): The Scripps Research Institute Molecular Screening Center (SRIMSC) Center Affiliation: The Scripps Research Institute (TS...
In DepthDetails PCBioAssay