BDBM55077 3-(1-benzofuran-2-carbonyl)-2-(3,4-dimethoxyphenyl)-4-hydroxy-1-(5-methyl-1,2-oxazol-3-yl)-2H-pyrrol-5-one::3-(1-benzofuran-2-ylcarbonyl)-2-(3,4-dimethoxyphenyl)-1-(5-methyl-1,2-oxazol-3-yl)-4-oxidanyl-2H-pyrrol-5-one::3-[2-benzofuranyl(oxo)methyl]-2-(3,4-dimethoxyphenyl)-4-hydroxy-1-(5-methyl-3-isoxazolyl)-2H-pyrrol-5-one::4-(benzofuran-2-carbonyl)-5-(3,4-dimethoxyphenyl)-3-hydroxy-1-(5-methylisoxazol-3-yl)-3-pyrrolin-2-one::MLS001142996::SMR000647544::cid_3765596
SMILES COc1ccc(cc1OC)C1C(C(=O)c2cc3ccccc3o2)C(=O)C(=O)N1c1cc(C)on1
InChI Key InChIKey=VKAZDQDHIIEBSV-UHFFFAOYSA-N
Data  1 IC50
  Tab Delimited (TSV)   2D SDfile   Computed 3D by Vconf -m prep SDfile
Find this compound or compounds like it in BindingDB:
Activity Spreadsheet -- Enzyme Inhibition Constant Data from BindingDB
Found 1 hit for monomerid = 55077
TargetGenome polyprotein(Hepatitis C virus)
The Scripps Research Institute Molecular Screening Center
Curated by PubChem BioAssay
LigandPNGBDBM55077(3-(1-benzofuran-2-carbonyl)-2-(3,4-dimethoxyphenyl...)
Affinity DataIC50:  4.98E+3nM. Assay description: Source (MLPCN Center Name): The Scripps Research Institute Molecular Screening Center (SRIMSC) Center Affiliation: The Scripps Research Institute (TS...
In DepthDetails PCBioAssay