BDBM55127 2-pyridyl(1,2,4-triazol-1-ylmethyl)amine::MLS000532581::N-(1,2,4-triazol-1-ylmethyl)-2-pyridinamine::N-(1,2,4-triazol-1-ylmethyl)pyridin-2-amine::N-(1H-1,2,4-triazol-1-ylmethyl)-2-pyridinamine::SMR000137520::cid_778505
SMILES C(Nc1ccccn1)n1cncn1
InChI Key InChIKey=PCXLFDYHBHKQHP-UHFFFAOYSA-N
Data  2 IC50
  Tab Delimited (TSV)   2D SDfile   Computed 3D by Vconf -m prep SDfile
Find this compound or compounds like it in BindingDB:
Activity Spreadsheet -- Enzyme Inhibition Constant Data from BindingDB
Found 2 hits for monomerid = 55127
TargetProcathepsin L(Homo sapiens (Human))
The Scripps Research Institute Molecular Screening Center
Curated by PubChem BioAssay
LigandPNGBDBM55127(2-pyridyl(1,2,4-triazol-1-ylmethyl)amine | MLS0005...)
Affinity DataIC50: >5.96E+4nM. Assay description: Source (MLPCN Center Name): The Scripps Research Institute Molecular Screening Center Affiliation: The Scripps Research Institute, TSRI Assay Provide...
In DepthDetails PCBioAssay
TargetM18 aspartyl aminopeptidase(Plasmodium falciparum 3D7)
The Scripps Research Institute Molecular Screening Center
Curated by PubChem BioAssay
LigandPNGBDBM55127(2-pyridyl(1,2,4-triazol-1-ylmethyl)amine | MLS0005...)
Affinity DataIC50:  2.57E+3nM. Assay description: Source (MLPCN Center Name): The Scripps Research Institute Molecular Screening Center Affiliation: The Scripps Research Institute, TSRI Assay Provide...
In DepthDetails PCBioAssay