BDBM55134 4-(2-Pyridin-3-yl-thiazol-4-yl)-benzene-1,2-diol::4-(2-pyridin-3-yl-1,3-thiazol-4-yl)benzene-1,2-diol::4-[2-(3-pyridinyl)-4-thiazolyl]benzene-1,2-diol::4-[2-(3-pyridyl)thiazol-4-yl]pyrocatechol::MLS000123629::SMR000124301::cid_740464
SMILES Oc1ccc(cc1O)-c1csc(n1)-c1cccnc1
InChI Key InChIKey=UKBQJLVXHXHRLL-UHFFFAOYSA-N
Data  2 IC50
  Tab Delimited (TSV)   2D SDfile   Computed 3D by Vconf -m prep SDfile
Find this compound or compounds like it in BindingDB:
Activity Spreadsheet -- Enzyme Inhibition Constant Data from BindingDB
Found 2 hits for monomerid = 55134
TargetProcathepsin L(Homo sapiens (Human))
The Scripps Research Institute Molecular Screening Center
Curated by PubChem BioAssay
LigandPNGBDBM55134(4-(2-Pyridin-3-yl-thiazol-4-yl)-benzene-1,2-diol |...)
Affinity DataIC50: >5.96E+4nM. Assay description: Source (MLPCN Center Name): The Scripps Research Institute Molecular Screening Center Affiliation: The Scripps Research Institute, TSRI Assay Provide...
In DepthDetails PCBioAssay
TargetM18 aspartyl aminopeptidase(Plasmodium falciparum 3D7)
The Scripps Research Institute Molecular Screening Center
Curated by PubChem BioAssay
LigandPNGBDBM55134(4-(2-Pyridin-3-yl-thiazol-4-yl)-benzene-1,2-diol |...)
Affinity DataIC50:  1.81E+3nM. Assay description: Source (MLPCN Center Name): The Scripps Research Institute Molecular Screening Center Affiliation: The Scripps Research Institute, TSRI Assay Provide...
In DepthDetails PCBioAssay