BDBM55156 MLS001174685::N-[2-(3,4-dihydroxyphenyl)ethyl]-2,3-dihydro-1,4-benzodioxin-3-carboxamide::N-[2-(3,4-dihydroxyphenyl)ethyl]-2,3-dihydro-1,4-benzodioxine-3-carboxamide::N-[2-[3,4-bis(oxidanyl)phenyl]ethyl]-2,3-dihydro-1,4-benzodioxine-3-carboxamide::SMR000589646::cid_4657144
SMILES Oc1ccc(CCNC(=O)C2COc3ccccc3O2)cc1O
InChI Key InChIKey=MEHVAMOHHSLLEP-UHFFFAOYSA-N
Data  2 IC50  1 EC50
  Tab Delimited (TSV)   2D SDfile   Computed 3D by Vconf -m prep SDfile
Find this compound or compounds like it in BindingDB:
Activity Spreadsheet -- Enzyme Inhibition Constant Data from BindingDB
Found 3 hits for monomerid = 55156
TargetM18 aspartyl aminopeptidase(Plasmodium falciparum 3D7)
The Scripps Research Institute Molecular Screening Center
Curated by PubChem BioAssay
LigandPNGBDBM55156(MLS001174685 | N-[2-(3,4-dihydroxyphenyl)ethyl]-2,...)
Affinity DataIC50:  2.11E+3nM. Assay description: Source (MLPCN Center Name): The Scripps Research Institute Molecular Screening Center Affiliation: The Scripps Research Institute, TSRI Assay Provide...
In DepthDetails PCBioAssay
TargetHeat shock factor protein 1(Mus musculus)
Broad Institute
Curated by PubChem BioAssay
LigandPNGBDBM55156(MLS001174685 | N-[2-(3,4-dihydroxyphenyl)ethyl]-2,...)
Affinity DataEC50:  2.85E+4nM. Assay description: Keywords: Heat Shock Factor-1 (HSF-1), Stress Response, MG132, NIH3T3, Luminescence Assay Overview: Confirmation testing of small molecules identifie...
In DepthDetails PCBioAssay
TargetProcathepsin L(Homo sapiens (Human))
The Scripps Research Institute Molecular Screening Center
Curated by PubChem BioAssay
LigandPNGBDBM55156(MLS001174685 | N-[2-(3,4-dihydroxyphenyl)ethyl]-2,...)
Affinity DataIC50: >5.96E+4nM. Assay description: Source (MLPCN Center Name): The Scripps Research Institute Molecular Screening Center Affiliation: The Scripps Research Institute, TSRI Assay Provide...
In DepthDetails PCBioAssay