BDBM55427 MLS000556371::N-(3-Cyano-5,6-dihydro-4H-cyclopenta[b]thiophen-2-yl)-2-[3-cyano-6-(3,4-dimethoxy-phenyl)-pyridin-2- ylsulfanyl]-acetamide::N-(3-cyano-5,6-dihydro-4H-cyclopenta[b]thiophen-2-yl)-2-[3-cyano-6-(3,4-dimethoxyphenyl)pyridin-2-yl]sulfanyl-ethanamide::N-(3-cyano-5,6-dihydro-4H-cyclopenta[b]thiophen-2-yl)-2-[3-cyano-6-(3,4-dimethoxyphenyl)pyridin-2-yl]sulfanylacetamide::N-(3-cyano-5,6-dihydro-4H-cyclopenta[b]thiophen-2-yl)-2-[[3-cyano-6-(3,4-dimethoxyphenyl)-2-pyridinyl]thio]acetamide::N-(3-cyano-5,6-dihydro-4H-cyclopenta[b]thiophen-2-yl)-2-[[3-cyano-6-(3,4-dimethoxyphenyl)-2-pyridyl]thio]acetamide::SMR000147688::cid_1773629
SMILES COc1ccc(cc1OC)-c1ccc(C#N)c(SCC(=O)Nc2sc3CCCc3c2C#N)n1
InChI Key InChIKey=MMEWMWJJQRCRQN-UHFFFAOYSA-N
Data  3 IC50
  Tab Delimited (TSV)   2D SDfile   Computed 3D by Vconf -m prep SDfile
Find this compound or compounds like it in BindingDB:
Activity Spreadsheet -- Enzyme Inhibition Constant Data from BindingDB
Found 3 hits for monomerid = 55427
TargetNeutrophil cytosol factor 1 [S99G](Homo sapiens (Human))
Emory University
Curated by PubChem BioAssay
LigandPNGBDBM55427(MLS000556371 | N-(3-Cyano-5,6-dihydro-4H-cyclopent...)
Affinity DataIC50:  5.00E+4nM. Assay description: NIH Molecular Libraries Screening Centers Network [MLSCN] Emory Chemical Biology Discovery Center in MLSCN Assay provider: Susan Smith, Emory Univers...
In DepthDetails PCBioAssay
TargetPhospholipase A2(Homo sapiens (Human))
Burnham Center For Chemical Genomics
Curated by PubChem BioAssay
LigandPNGBDBM55427(MLS000556371 | N-(3-Cyano-5,6-dihydro-4H-cyclopent...)
Affinity DataIC50:  4.06E+3nM. Assay description: Data Source: Sanford-Burnham Center for Chemical Genomics (SBCCG) Source Affiliation: Sanford-Burnham Medical Research Institute (SBMRI, San Diego, C...
In DepthDetails PCBioAssay
TargetCysteine protease ATG4B(Homo sapiens (Human))
Burnham Center For Chemical Genomics
Curated by PubChem BioAssay
LigandPNGBDBM55427(MLS000556371 | N-(3-Cyano-5,6-dihydro-4H-cyclopent...)
Affinity DataIC50:  5.44E+3nM. Assay description: Data Source: Sanford-Burnham Center for Chemical Genomics (SBCCG) Source Affiliation: Sanford-Burnham Medical Research Institute (SBMRI, San Diego, C...
In DepthDetails PCBioAssay