BDBM55680 4-[(E)-[4-(3-chlorobenzyl)-3-keto-1,4-benzothiazin-2-ylidene]methyl]-N-[3-(4-methylpiperazino)propyl]benzamide::4-[(E)-[4-[(3-chlorophenyl)methyl]-3-oxidanylidene-1,4-benzothiazin-2-ylidene]methyl]-N-[3-(4-methylpiperazin-1-yl)propyl]benzamide::4-[(E)-[4-[(3-chlorophenyl)methyl]-3-oxo-1,4-benzothiazin-2-ylidene]methyl]-N-[3-(4-methyl-1-piperazinyl)propyl]benzamide::4-[(E)-[4-[(3-chlorophenyl)methyl]-3-oxo-1,4-benzothiazin-2-ylidene]methyl]-N-[3-(4-methylpiperazin-1-yl)propyl]benzamide::4-{(E)-[4-(3-chlorobenzyl)-3-oxo-3,4-dihydro-2H-1,4-benzothiazin-2-ylidene]methyl}-N-[3-(4-methylpiperazin-1-yl)propyl]benzamide::MLS000682565::SMR000311922::cid_16187656
SMILES CN1CCN(CCCNC(=O)c2ccc(\C=C3\Sc4ccccc4N(Cc4cccc(Cl)c4)C3=O)cc2)CC1
InChI Key InChIKey=NELFVCYPOVDLKP-XHLNEMQHSA-N
Data  1 IC50
  Tab Delimited (TSV)   2D SDfile   Computed 3D by Vconf -m prep SDfile
Find this compound or compounds like it in BindingDB:
Activity Spreadsheet -- Enzyme Inhibition Constant Data from BindingDB
Found 1 hit for monomerid = 55680
TargetNeutrophil cytosol factor 1 [S99G](Homo sapiens (Human))
Emory University
Curated by PubChem BioAssay
LigandPNGBDBM55680(4-[(E)-[4-(3-chlorobenzyl)-3-keto-1,4-benzothiazin...)
Affinity DataIC50:  4.42E+3nM. Assay description: NIH Molecular Libraries Screening Centers Network [MLSCN] Emory Chemical Biology Discovery Center in MLSCN Assay provider: Susan Smith, Emory Univers...
In DepthDetails PCBioAssay