BDBM55818 MLS000730814::N-[2-(4-ethyl-1-piperazinyl)ethyl]-4-[(Z)-[4-[(2-fluorophenyl)methyl]-3-oxo-1,4-benzothiazin-2-ylidene]methyl]benzamide::N-[2-(4-ethylpiperazin-1-yl)ethyl]-4-[(Z)-[4-[(2-fluorophenyl)methyl]-3-oxidanylidene-1,4-benzothiazin-2-ylidene]methyl]benzamide::N-[2-(4-ethylpiperazin-1-yl)ethyl]-4-[(Z)-[4-[(2-fluorophenyl)methyl]-3-oxo-1,4-benzothiazin-2-ylidene]methyl]benzamide::N-[2-(4-ethylpiperazin-1-yl)ethyl]-4-{(Z)-[4-(2-fluorobenzyl)-3-oxo-3,4-dihydro-2H-1,4-benzothiazin-2-ylidene]methyl}benzamide::N-[2-(4-ethylpiperazino)ethyl]-4-[(Z)-[4-(2-fluorobenzyl)-3-keto-1,4-benzothiazin-2-ylidene]methyl]benzamide::SMR000308989::cid_16195590
SMILES CCN1CCN(CCNC(=O)c2ccc(\C=C3/Sc4ccccc4N(Cc4ccccc4F)C3=O)cc2)CC1
InChI Key InChIKey=LKWNQQVTFQKJHY-ANYBSYGZSA-N
Data  1 IC50  2 EC50
  Tab Delimited (TSV)   2D SDfile   Computed 3D by Vconf -m prep SDfile
Find this compound or compounds like it in BindingDB:
Activity Spreadsheet -- Enzyme Inhibition Constant Data from BindingDB
Found 3 hits for monomerid = 55818
TargetNeutrophil cytosol factor 1 [S99G](Homo sapiens (Human))
Emory University
Curated by PubChem BioAssay
LigandPNGBDBM55818(MLS000730814 | N-[2-(4-ethyl-1-piperazinyl)ethyl]-...)
Affinity DataIC50:  5.47E+3nM. Assay description: NIH Molecular Libraries Screening Centers Network [MLSCN] Emory Chemical Biology Discovery Center in MLSCN Assay provider: Susan Smith, Emory Univers...
In DepthDetails PCBioAssay
TargetDelta-type opioid receptor(Homo sapiens (Human))
The Scripps Research Institute Molecular Screening Center
Curated by PubChem BioAssay
LigandPNGBDBM55818(MLS000730814 | N-[2-(4-ethyl-1-piperazinyl)ethyl]-...)
Affinity DataEC50: >9.25E+4nM. Assay description: Source (MLPCN Center Name): The Scripps Research Institute Molecular Screening Center (SRISMC) Center Affiliation: The Scripps Research Institute, TS...
In DepthDetails PCBioAssay
TargetMelanocortin receptor 4(Homo sapiens (Human))
The Scripps Research Institute Molecular Screening Center
Curated by PubChem BioAssay
LigandPNGBDBM55818(MLS000730814 | N-[2-(4-ethyl-1-piperazinyl)ethyl]-...)
Affinity DataEC50: >8.92E+4nM. Assay description: Source (MLPCN Center Name): The Scripps Research Institute Molecular Screening Center (SRISMC) Center Affiliation: The Scripps Research Institute, TS...
In DepthDetails PCBioAssay