BDBM56624 (3-anilinophenyl)-phenyl-amine::1-N,3-N-diphenylbenzene-1,3-diamine::MLS000756258::N1,N3-diphenylbenzene-1,3-diamine::N~1~,N~3~-diphenyl-1,3-benzenediamine::SMR000224804::cid_245216
SMILES N(c1ccccc1)c1cccc(Nc2ccccc2)c1
InChI Key InChIKey=WULZIURTBVLJRF-UHFFFAOYSA-N
Data  3 IC50
  Tab Delimited (TSV)   2D SDfile   Computed 3D by Vconf -m prep SDfile
Find this compound or compounds like it in BindingDB:
Activity Spreadsheet -- Enzyme Inhibition Constant Data from BindingDB
Found 3 hits for monomerid = 56624
TargetKallikrein-5(Homo sapiens (Human))
Pcmd
Curated by PubChem BioAssay
LigandPNGBDBM56624((3-anilinophenyl)-phenyl-amine | 1-N,3-N-diphenylb...)
Affinity DataIC50:  5.00E+4nM. Assay description: Molecular Library Screening Center Network (MLSCN) Penn Center for Molecular Discovery (PCMD) Assay Provider: Scott L. Diamond, University of Pennsy...
In DepthDetails PCBioAssay
TargetMitochondrial import inner membrane translocase subunit TIM23(Saccharomyces cerevisiae S288c)
Burnham Center For Chemical Genomics
Curated by PubChem BioAssay
LigandPNGBDBM56624((3-anilinophenyl)-phenyl-amine | 1-N,3-N-diphenylb...)
Affinity DataIC50:  1.10E+4nM. Assay description: Data Source: Sanford-Burnham Center for Chemical Genomics (SBCCG) Source Affiliation: Sanford-Burnham Medical Research Institute(SBMRI, San Diego, CA...
In DepthDetails PCBioAssay
TargetMitochondrial import inner membrane translocase subunit TIM10(Saccharomyces cerevisiae S288c)
Burnham Center For Chemical Genomics
Curated by PubChem BioAssay
LigandPNGBDBM56624((3-anilinophenyl)-phenyl-amine | 1-N,3-N-diphenylb...)
Affinity DataIC50:  1.12E+4nM. Assay description: Data Source: Sanford-Burnham Center for Chemical Genomics (SBCCG) Source Affiliation: Sanford-Burnham Medical Research Institute(SBMRI, San Diego, CA...
In DepthDetails PCBioAssay