BDBM56765 3-(5-methyl-1H-pyrazol-3-yl)-4-[(3,4,5-trimethoxybenzylidene)amino]-1H-1,2,4-triazole-5-thione::3-(5-methyl-1H-pyrazol-3-yl)-4-[(3,4,5-trimethoxyphenyl)methylideneamino]-1H-1,2,4-triazole-5-thione::5-(5-Methyl-2H-pyrazol-3-yl)-4-{[1-(3,4,5-trimethoxy-phenyl)-meth-(E)-ylidene]-amino}-4H-[1,2,4]triazole- 3-thiol::MLS000762660::SMR000438136::cid_1402246
SMILES COc1cc(C=Nn2c(n[nH]c2=S)-c2cc(C)[nH]n2)cc(OC)c1OC
InChI Key InChIKey=SSZDDSLJVQZUQO-UHFFFAOYSA-N
Data  3 IC50
  Tab Delimited (TSV)   2D SDfile   Computed 3D by Vconf -m prep SDfile
Find this compound or compounds like it in BindingDB:
Activity Spreadsheet -- Enzyme Inhibition Constant Data from BindingDB
Found 3 hits for monomerid = 56765
TargetKallikrein-5(Homo sapiens (Human))
Pcmd
Curated by PubChem BioAssay
LigandPNGBDBM56765(3-(5-methyl-1H-pyrazol-3-yl)-4-[(3,4,5-trimethoxyb...)
Affinity DataIC50:  5.00E+4nM. Assay description: Molecular Library Screening Center Network (MLSCN) Penn Center for Molecular Discovery (PCMD) Assay Provider: Scott L. Diamond, University of Pennsy...
In DepthDetails PCBioAssay
TargetDNA dC->dU-editing enzyme APOBEC-3A(Homo sapiens (Human))
Burnham Center For Chemical Genomics
Curated by PubChem BioAssay
LigandPNGBDBM56765(3-(5-methyl-1H-pyrazol-3-yl)-4-[(3,4,5-trimethoxyb...)
Affinity DataIC50: >1.00E+5nMT: 2°C. Assay description: Data Source: Sanford-Burnham Center for Chemical Genomics (SBCCG) Source Affiliation: Sanford-Burnham Medical Research Institute (SBMRI, San Diego, C...
In DepthDetails PCBioAssay
TargetDNA dC->dU-editing enzyme APOBEC-3G(Homo sapiens (Human))
Burnham Center For Chemical Genomics
Curated by PubChem BioAssay
LigandPNGBDBM56765(3-(5-methyl-1H-pyrazol-3-yl)-4-[(3,4,5-trimethoxyb...)
Affinity DataIC50:  2.50E+3nMT: 2°C. Assay description: Data Source: Sanford-Burnham Center for Chemical Genomics (SBCCG) Source Affiliation: Sanford-Burnham Medical Research Institute (SBMRI, San Diego, C...
In DepthDetails PCBioAssay