BDBM56845 (E)-3-(1-methyl-3-indolyl)-2-(4-methylphenyl)-2-propenenitrile::(E)-3-(1-methylindol-3-yl)-2-(4-methylphenyl)prop-2-enenitrile::(E)-3-(1-methylindol-3-yl)-2-(p-tolyl)acrylonitrile::3-(1-methyl-1H-indol-3-yl)-2-(4-methylphenyl)acrylonitrile::MLS000051428::SMR000079628::cid_2224088
SMILES Cc1ccc(cc1)C(=C/c1cn(C)c2ccccc12)\C#N
InChI Key InChIKey=BXXHBPQGHBBZDJ-WJDWOHSUSA-N
Data  1 IC50
  Tab Delimited (TSV)   2D SDfile   Computed 3D by Vconf -m prep SDfile
Find this compound or compounds like it in BindingDB:
Activity Spreadsheet -- Enzyme Inhibition Constant Data from BindingDB
Found 1 hit for monomerid = 56845
TargetDNA repair protein RAD51 homolog 1(Homo sapiens (Human))
Pcmd
Curated by PubChem BioAssay
LigandPNGBDBM56845((E)-3-(1-methyl-3-indolyl)-2-(4-methylphenyl)-2-pr...)
Affinity DataIC50:  4.25E+4nM. Assay description: Project Title: A screen for modulators of human Rad51, a key DNA repair protein Application Number: MH084119 Assay Submitter: Dr. Alex Mazin Submitte...
In DepthDetails PCBioAssay