BDBM56856 1-(4-Methoxy-benzenesulfonyl)-piperidine-3-carboxylic acid ethyl ester::1-(4-methoxyphenyl)sulfonyl-3-piperidinecarboxylic acid ethyl ester::1-(4-methoxyphenyl)sulfonylnipecotic acid ethyl ester::MLS000123091::SMR000123628::cid_2904830::ethyl 1-(4-methoxyphenyl)sulfonylpiperidine-3-carboxylate
SMILES CCOC(=O)C1CCCN(C1)S(=O)(=O)c1ccc(OC)cc1
InChI Key InChIKey=VEKOATLOLUSJGX-UHFFFAOYSA-N
Data  1 IC50
  Tab Delimited (TSV)   2D SDfile   Computed 3D by Vconf -m prep SDfile
Find this compound or compounds like it in BindingDB:
Activity Spreadsheet -- Enzyme Inhibition Constant Data from BindingDB
Found 1 hit for monomerid = 56856
TargetDNA repair protein RAD51 homolog 1(Homo sapiens (Human))
Pcmd
Curated by PubChem BioAssay
LigandPNGBDBM56856(1-(4-Methoxy-benzenesulfonyl)-piperidine-3-carboxy...)
Affinity DataIC50:  8.50E+4nM. Assay description: Project Title: A screen for modulators of human Rad51, a key DNA repair protein Application Number: MH084119 Assay Submitter: Dr. Alex Mazin Submitte...
In DepthDetails PCBioAssay