BDBM57349 (3-Amino-6-isopropyl-thieno[2,3-b]quinolin-2-yl)-(3,4-dihydro-1H-isoquinolin-2-yl)-methanone::(3-amino-6-isopropyl-thieno[2,3-b]quinolin-2-yl)-(3,4-dihydro-1H-isoquinolin-2-yl)methanone::(3-amino-6-propan-2-yl-2-thieno[2,3-b]quinolinyl)-(3,4-dihydro-1H-isoquinolin-2-yl)methanone::(3-amino-6-propan-2-ylthieno[2,3-b]quinolin-2-yl)-(3,4-dihydro-1H-isoquinolin-2-yl)methanone::(3-azanyl-6-propan-2-yl-thieno[2,3-b]quinolin-2-yl)-(3,4-dihydro-1H-isoquinolin-2-yl)methanone::MLS000556129::SMR000173127::cid_1442685
SMILES CC(C)c1ccc2nc3sc(C(=O)N4CCc5ccccc5C4)c(N)c3cc2c1
InChI Key InChIKey=TUDLYWRFLDZAFJ-UHFFFAOYSA-N
Data  4 IC50  1 EC50
  Tab Delimited (TSV)   2D SDfile   Computed 3D by Vconf -m prep SDfile
Find this compound or compounds like it in BindingDB:
Activity Spreadsheet -- Enzyme Inhibition Constant Data from BindingDB
Found 5 hits for monomerid = 57349
TargetStreptokinase A(Streptococcus pyogenes M1 GAS)
Broad Institute
Curated by PubChem BioAssay
LigandPNGBDBM57349((3-Amino-6-isopropyl-thieno[2,3-b]quinolin-2-yl)-(...)
Affinity DataEC50:  1.01E+5nM. Assay description: Keywords: Group A streptococcus, GAS, streptokinase, expression, virulence, inhibition, dose response, EC50 Assay Overview: The goal of this assa...
In DepthDetails PCBioAssay
TargetCysteine protease ATG4B(Homo sapiens (Human))
Burnham Center For Chemical Genomics
Curated by PubChem BioAssay
LigandPNGBDBM57349((3-Amino-6-isopropyl-thieno[2,3-b]quinolin-2-yl)-(...)
Affinity DataIC50:  7.08E+3nM. Assay description: Data Source: Sanford-Burnham Center for Chemical Genomics (SBCCG) Source Affiliation: Sanford-Burnham Medical Research Institute (SBMRI, San Diego, C...
In DepthDetails PCBioAssay
TargetSentrin-specific protease 1(Homo sapiens (Human))
Burnham Center For Chemical Genomics
Curated by PubChem BioAssay
LigandPNGBDBM57349((3-Amino-6-isopropyl-thieno[2,3-b]quinolin-2-yl)-(...)
Affinity DataIC50:  2.58E+3nM
In DepthDetails PCBioAssay
TargetSentrin-specific protease 1(Homo sapiens (Human))
Burnham Center For Chemical Genomics
Curated by PubChem BioAssay
LigandPNGBDBM57349((3-Amino-6-isopropyl-thieno[2,3-b]quinolin-2-yl)-(...)
Affinity DataIC50:  5.22E+3nM
In DepthDetails PCBioAssay
TargetPhospholipase A2(Homo sapiens (Human))
Burnham Center For Chemical Genomics
Curated by PubChem BioAssay
LigandPNGBDBM57349((3-Amino-6-isopropyl-thieno[2,3-b]quinolin-2-yl)-(...)
Affinity DataIC50:  4.83E+3nM. Assay description: Data Source: Sanford-Burnham Center for Chemical Genomics (SBCCG) Source Affiliation: Sanford-Burnham Medical Research Institute (SBMRI, San Diego, C...
In DepthDetails PCBioAssay