BDBM57744 4-chloranyl-N-[5-(furan-2-yl)-1,3,4-oxadiazol-2-yl]benzamide::4-chloro-N-[5-(2-furanyl)-1,3,4-oxadiazol-2-yl]benzamide::4-chloro-N-[5-(2-furyl)-1,3,4-oxadiazol-2-yl]benzamide::4-chloro-N-[5-(furan-2-yl)-1,3,4-oxadiazol-2-yl]benzamide::MLS000683071::SMR000323146::cid_5223276
SMILES Clc1ccc(cc1)C(=O)Nc1nnc(o1)-c1ccco1
InChI Key InChIKey=BGANTABLOXAURB-UHFFFAOYSA-N
Data  2 EC50
  Tab Delimited (TSV)   2D SDfile   Computed 3D by Vconf -m prep SDfile
Find this compound or compounds like it in BindingDB:
Activity Spreadsheet -- Enzyme Inhibition Constant Data from BindingDB
Found 2 hits for monomerid = 57744
TargetATP-dependent molecular chaperone HSP82(Candida albicans)
Broad Institute
Curated by PubChem BioAssay
LigandPNGBDBM57744(4-chloranyl-N-[5-(furan-2-yl)-1,3,4-oxadiazol-2-yl...)
Affinity DataEC50:  4.50E+4nM. Assay description: Keywords: Candida albicans, drug resistance, Fluconazole, Hsp90, stress response Assay Overview: Method for determining if compound acts as Hsp90 inh...
In DepthDetails PCBioAssay
TargetStreptokinase A(Streptococcus pyogenes M1 GAS)
Broad Institute
Curated by PubChem BioAssay
LigandPNGBDBM57744(4-chloranyl-N-[5-(furan-2-yl)-1,3,4-oxadiazol-2-yl...)
Affinity DataEC50:  1.50E+5nM. Assay description: Keywords: Group A streptococcus, GAS, streptokinase, expression, virulence, inhibition, dose response, EC50 Assay Overview: The goal of this assa...
In DepthDetails PCBioAssay