BDBM58016 2-(4-hydroxyphenyl)-6-(3-methylbut-2-enyl)-5,7-bis(oxidanyl)-2,3-dihydrochromen-4-one::5,7-dihydroxy-2-(4-hydroxyphenyl)-6-(3-methylbut-2-enyl)-2,3-dihydrochromen-4-one::5,7-dihydroxy-2-(4-hydroxyphenyl)-6-(3-methylbut-2-enyl)-3,4-dihydro-2H-1-benzopyran-4-one::5,7-dihydroxy-2-(4-hydroxyphenyl)-6-(3-methylbut-2-enyl)chroman-4-one::MLS000863575::SMR000440733::cid_3519901
SMILES [#6]\[#6](-[#6])=[#6]\[#6]-c1c(-[#8])cc2-[#8]-[#6](-[#6]-[#6](=O)-c2c1-[#8])-c1ccc(-[#8])cc1
InChI Key InChIKey=YHWNASRGLKJRJJ-UHFFFAOYSA-N
Data  2 IC50  3 EC50
  Tab Delimited (TSV)   2D SDfile   Computed 3D by Vconf -m prep SDfile
Find this compound or compounds like it in BindingDB:
Activity Spreadsheet -- Enzyme Inhibition Constant Data from BindingDB
Found 5 hits for monomerid = 58016
TargetStreptokinase A(Streptococcus pyogenes M1 GAS)
Broad Institute
Curated by PubChem BioAssay
LigandPNGBDBM58016(2-(4-hydroxyphenyl)-6-(3-methylbut-2-enyl)-5,7-bis...)
Affinity DataEC50:  1.50E+5nM. Assay description: Keywords: Group A streptococcus, GAS, streptokinase, expression, virulence, inhibition, dose response, EC50 Assay Overview: The goal of this assa...
In DepthDetails PCBioAssay
TargetGlycogen synthase kinase-3 beta(Homo sapiens (Human))
Broad Institute
Curated by PubChem BioAssay
LigandPNGBDBM58016(2-(4-hydroxyphenyl)-6-(3-methylbut-2-enyl)-5,7-bis...)
Affinity DataEC50: >3.00E+5nM. Assay description: Keywords: GSK3beta, dose response, kinase, inhibition, HTS Assay Overview: The glycogen synthase kinase-3 beta (GSK-3b) is a known master regulator f...
In DepthDetails PCBioAssay
TargetVoltage-dependent T-type calcium channel subunit alpha-1H(Homo sapiens (Human))
University Of Toyama
Curated by ChEMBL
LigandPNGBDBM58016(2-(4-hydroxyphenyl)-6-(3-methylbut-2-enyl)-5,7-bis...)
Affinity DataIC50:  1.00E+3nM. Assay description: Inhibition of human CaV3.2 expressed in HEK293 cells assessed as suppression of T-current amplitude after 10 mins by whole cell patch clamp method
In DepthDetails ArticlePubMed
TargetVoltage-dependent T-type calcium channel subunit alpha-1G(Homo sapiens (Human))
University Of Toyama
Curated by ChEMBL
LigandPNGBDBM58016(2-(4-hydroxyphenyl)-6-(3-methylbut-2-enyl)-5,7-bis...)
Affinity DataIC50:  1.00E+3nM. Assay description: Inhibition of human CaV3.1 expressed in HEK293 cells assessed as suppression of T-current after 10 mins by whole cell patch clamp method
In DepthDetails ArticlePubMed
TargetEstrogen receptor(Homo sapiens (Human))
Hallertauer Hopfenveredelung
Curated by ChEMBL
LigandPNGBDBM58016(2-(4-hydroxyphenyl)-6-(3-methylbut-2-enyl)-5,7-bis...)
Affinity DataEC50:  400nM. Assay description: Estrogenic activity at estrogen receptor alpha in human Ishikawa cells assessed as induction of alkaline phosphatase activity using p-Nitrophenol pho...
In DepthDetails ArticlePubMed