BDBM58163 3-(6-Methyl-benzothiazol-2-yl)-2-thioxo-imidazolidin-4-one::3-(6-methyl-1,3-benzothiazol-2-yl)-2-sulfanylidene-4-imidazolidinone::3-(6-methyl-1,3-benzothiazol-2-yl)-2-sulfanylidene-imidazolidin-4-one::3-(6-methyl-1,3-benzothiazol-2-yl)-2-sulfanylideneimidazolidin-4-one::3-(6-methyl-1,3-benzothiazol-2-yl)-2-thioxo-4-imidazolidinone::MLS000768544::SMR000431824::cid_896091
SMILES Cc1ccc2nc(sc2c1)-n1c(O)c[nH]c1=S
InChI Key InChIKey=DKLMIQGSOYYIFP-UHFFFAOYSA-N
Data  6 IC50  1 EC50
  Tab Delimited (TSV)   2D SDfile   Computed 3D by Vconf -m prep SDfile
Find this compound or compounds like it in BindingDB:
Activity Spreadsheet -- Enzyme Inhibition Constant Data from BindingDB
Found 7 hits for monomerid = 58163
TargetStreptokinase A(Streptococcus pyogenes M1 GAS)
Broad Institute
Curated by PubChem BioAssay
LigandPNGBDBM58163(3-(6-Methyl-benzothiazol-2-yl)-2-thioxo-imidazolid...)
Affinity DataEC50:  1.50E+5nM. Assay description: Keywords: Group A streptococcus, GAS, streptokinase, expression, virulence, inhibition, dose response, EC50 Assay Overview: The goal of this assa...
In DepthDetails PCBioAssay
TargetBeta-galactosidase(Escherichia coli)
Burnham Center For Chemical Genomics
Curated by PubChem BioAssay
LigandPNGBDBM58163(3-(6-Methyl-benzothiazol-2-yl)-2-thioxo-imidazolid...)
Affinity DataIC50: >6.66E+4nM. Assay description: Data Source: Sanford-Burnham Center for Chemical Genomics (SBCCG) Source Affiliation: Sanford-Burnham Medical Research Institute(SBMRI, San Diego, C...
In DepthDetails PCBioAssay
TargetC-C chemokine receptor type 6(Homo sapiens (Human))
Burnham Center For Chemical Genomics
Curated by PubChem BioAssay
LigandPNGBDBM58163(3-(6-Methyl-benzothiazol-2-yl)-2-thioxo-imidazolid...)
Affinity DataIC50:  2.51E+4nM. Assay description: Data Source: Sanford-Burnham Center for Chemical Genomics (SBCCG) Source Affiliation: Sanford-Burnham Medical Research Institute(SBMRI, San Diego, CA...
In DepthDetails PCBioAssay
TargetMitochondrial import inner membrane translocase subunit TIM10(Saccharomyces cerevisiae S288c)
Burnham Center For Chemical Genomics
Curated by PubChem BioAssay
LigandPNGBDBM58163(3-(6-Methyl-benzothiazol-2-yl)-2-thioxo-imidazolid...)
Affinity DataIC50:  6.81E+3nM. Assay description: Data Source: Sanford-Burnham Center for Chemical Genomics (SBCCG) Source Affiliation: Sanford-Burnham Medical Research Institute(SBMRI, San Diego, CA...
In DepthDetails PCBioAssay
TargetMitochondrial import inner membrane translocase subunit TIM23(Saccharomyces cerevisiae S288c)
Burnham Center For Chemical Genomics
Curated by PubChem BioAssay
LigandPNGBDBM58163(3-(6-Methyl-benzothiazol-2-yl)-2-thioxo-imidazolid...)
Affinity DataIC50:  5.04E+4nM. Assay description: Data Source: Sanford-Burnham Center for Chemical Genomics (SBCCG) Source Affiliation: Sanford-Burnham Medical Research Institute(SBMRI, San Diego, CA...
In DepthDetails PCBioAssay
TargetMitochondrial import inner membrane translocase subunit TIM10(Saccharomyces cerevisiae S288c)
Burnham Center For Chemical Genomics
Curated by PubChem BioAssay
LigandPNGBDBM58163(3-(6-Methyl-benzothiazol-2-yl)-2-thioxo-imidazolid...)
Affinity DataIC50:  1.30E+4nM. Assay description: Data Source: Sanford-Burnham Center for Chemical Genomics (SBCCG) Source Affiliation: Sanford-Burnham Medical Research Institute(SBMRI, San Diego, CA...
In DepthDetails PCBioAssay
TargetMitochondrial import inner membrane translocase subunit TIM10(Saccharomyces cerevisiae S288c)
Burnham Center For Chemical Genomics
Curated by PubChem BioAssay
LigandPNGBDBM58163(3-(6-Methyl-benzothiazol-2-yl)-2-thioxo-imidazolid...)
Affinity DataIC50: >1.00E+5nM. Assay description: Data Source: Sanford-Burnham Center for Chemical Genomics (SBCCG) Source Affiliation: Sanford-Burnham Medical Research Institute(SBMRI, San Diego, CA...
In DepthDetails PCBioAssay