BDBM58342 (5E)-5-[4-(4-ethoxy-N-methyl-anilino)benzylidene]-2-thioxo-thiazolidin-4-one::(5E)-5-[[4-(4-ethoxy-N-methylanilino)phenyl]methylidene]-2-sulfanylidene-1,3-thiazolidin-4-one::(5E)-5-[[4-(4-ethoxy-N-methylanilino)phenyl]methylidene]-2-sulfanylidene-4-thiazolidinone::(5E)-5-[[4-[(4-ethoxyphenyl)-methyl-amino]phenyl]methylidene]-2-sulfanylidene-1,3-thiazolidin-4-one::5-{4-[(4-Ethoxy-phenyl)-methyl-amino]-benzylidene}-2-thioxo-thiazolidin-4-one::MLS001212597::SMR000518479::cid_5767616
SMILES CCOc1ccc(cc1)N(C)c1ccc(C=C2SC(S)=NC2=O)cc1
InChI Key InChIKey=PHAQFNIPMCUMME-UHFFFAOYSA-N
Data  1 IC50  1 EC50
  Tab Delimited (TSV)   2D SDfile   Computed 3D by Vconf -m prep SDfile
Find this compound or compounds like it in BindingDB:
Activity Spreadsheet -- Enzyme Inhibition Constant Data from BindingDB
Found 2 hits for monomerid = 58342
TargetStreptokinase A(Streptococcus pyogenes M1 GAS)
Broad Institute
Curated by PubChem BioAssay
LigandPNGBDBM58342((5E)-5-[4-(4-ethoxy-N-methyl-anilino)benzylidene]-...)
Affinity DataEC50:  1.50E+5nM. Assay description: Keywords: Group A streptococcus, GAS, streptokinase, expression, virulence, inhibition, dose response, EC50 Assay Overview: The goal of this assa...
In DepthDetails PCBioAssay
TargetG-protein coupled receptor 35(Homo sapiens (Human))
Burnham Center For Chemical Genomics
Curated by PubChem BioAssay
LigandPNGBDBM58342((5E)-5-[4-(4-ethoxy-N-methyl-anilino)benzylidene]-...)
Affinity DataIC50:  701nM. Assay description: Data Source: Sanford-Burnham Center for Chemical Genomics (SBCCG) Source Affiliation: Sanford-Burnham Medical Research Institute (SBMRI, San Diego, C...
In DepthDetails PCBioAssay