BDBM58876 MLS001066043::N-butyl-2-[3-(4-methoxyphenyl)phenyl]-6-methyl-3-imidazo[1,2-a]pyridinamine;2,2,2-trifluoroacetic acid::N-butyl-2-[3-(4-methoxyphenyl)phenyl]-6-methyl-imidazo[1,2-a]pyridin-3-amine;2,2,2-tris(fluoranyl)ethanoic acid::N-butyl-2-[3-(4-methoxyphenyl)phenyl]-6-methylimidazo[1,2-a]pyridin-3-amine;2,2,2-trifluoroacetic acid::SMR000814678::butyl-[2-[3-(4-methoxyphenyl)phenyl]-6-methyl-imidazo[1,2-a]pyridin-3-yl]amine;2,2,2-trifluoroacetic acid::cid_24892525
SMILES CCCCNc1c(nc2ccc(C)cn12)-c1cccc(c1)-c1ccc(OC)cc1
InChI Key InChIKey=FNPMCMPOINPYJL-UHFFFAOYSA-N
Data  3 EC50
  Tab Delimited (TSV)   2D SDfile   Computed 3D by Vconf -m prep SDfile
Find this compound or compounds like it in BindingDB:
Activity Spreadsheet -- Enzyme Inhibition Constant Data from BindingDB
Found 3 hits for monomerid = 58876
TargetStreptokinase A(Streptococcus pyogenes M1 GAS)
Broad Institute
Curated by PubChem BioAssay
LigandPNGBDBM58876(MLS001066043 | N-butyl-2-[3-(4-methoxyphenyl)pheny...)
Affinity DataEC50:  7.94E+3nM. Assay description: Keywords: Group A streptococcus, GAS, streptokinase, expression, virulence, inhibition, dose response, EC50 Assay Overview: The goal of this assa...
In DepthDetails PCBioAssay
TargetApelin receptor(Homo sapiens (Human))
Burnham Center For Chemical Genomics
Curated by PubChem BioAssay
LigandPNGBDBM58876(MLS001066043 | N-butyl-2-[3-(4-methoxyphenyl)pheny...)
Affinity DataEC50: >1.00E+5nM. Assay description: Data Source: Sanford-Burnham Center for Chemical Genomics (SBCCG) Source Affiliation: Sanford-Burnham Medical Research Institute(SBMRI, San Diego) Ne...
In DepthDetails PCBioAssay
TargetType-1 angiotensin II receptor(Homo sapiens (Human))
Burnham Center For Chemical Genomics
Curated by PubChem BioAssay
LigandPNGBDBM58876(MLS001066043 | N-butyl-2-[3-(4-methoxyphenyl)pheny...)
Affinity DataEC50: >1.00E+5nM. Assay description: Data Source: Sanford-Burnham Center for Chemical Genomics (SBCCG) Source Affiliation: Sanford-Burnham Medical Research Institute(SBMRI, San Diego) Ne...
In DepthDetails PCBioAssay