BDBM59283 MLS000552881::N'-[3-[(5Z)-5-(3-bromobenzylidene)-4-keto-2-thioxo-thiazolidin-3-yl]propanoyl]nicotinohydrazide::N'-[3-[(5Z)-5-[(3-bromophenyl)methylidene]-4-oxidanylidene-2-sulfanylidene-1,3-thiazolidin-3-yl]propanoyl]pyridine-3-carbohydrazide::N'-[3-[(5Z)-5-[(3-bromophenyl)methylidene]-4-oxo-2-sulfanylidene-1,3-thiazolidin-3-yl]propanoyl]pyridine-3-carbohydrazide::N'-[3-[(5Z)-5-[(3-bromophenyl)methylidene]-4-oxo-2-sulfanylidene-3-thiazolidinyl]-1-oxopropyl]-3-pyridinecarbohydrazide::Nicotinic acid N'-{3-[5-(3-bromo-benzylidene)-4-oxo-2-thioxo-thiazolidin-3-yl]-propionyl}-hydrazide::SMR000177696::cid_5766840
SMILES Brc1cccc(\C=C2/SC(=S)N(CCC(=O)NNC(=O)c3cccnc3)C2=O)c1
InChI Key InChIKey=YTBWCFUTANFPRB-GDNBJRDFSA-N
Data  1 EC50
  Tab Delimited (TSV)   2D SDfile   Computed 3D by Vconf -m prep SDfile
Find this compound or compounds like it in BindingDB:
Activity Spreadsheet -- Enzyme Inhibition Constant Data from BindingDB
Found 1 hit for monomerid = 59283
TargetAlkaline phosphatase, tissue-nonspecific isozyme(Homo sapiens (Human))
Sanford-Burnham Center For Chemical Genomics
Curated by PubChem BioAssay
LigandPNGBDBM59283(MLS000552881 | N'-[3-[(5Z)-5-(3-bromobenzylidene)-...)
Affinity DataEC50:  8.38E+4nM. Assay description: Data Source: Sanford-Burnham Center for Chemical Genomics (SBCCG) Source Affiliation: Sanford-Burnham Medical Research Institute (SBMRI, San Diego, C...
In DepthDetails PCBioAssay