BDBM59436 MLS000555323::N-[(E)-1-[2-(diethylamino)ethylcarbamoyl]-2-(1-methylpyrrol-2-yl)vinyl]thiophene-2-carboxamide::N-[(E)-3-[2-(diethylamino)ethylamino]-1-(1-methyl-2-pyrrolyl)-3-oxoprop-1-en-2-yl]-2-thiophenecarboxamide::N-[(E)-3-[2-(diethylamino)ethylamino]-1-(1-methylpyrrol-2-yl)-3-oxidanylidene-prop-1-en-2-yl]thiophene-2-carboxamide::N-[(E)-3-[2-(diethylamino)ethylamino]-1-(1-methylpyrrol-2-yl)-3-oxoprop-1-en-2-yl]thiophene-2-carboxamide::SMR000173687::Thiophene-2-carboxylic acid [1-(2-diethylamino-ethylcarbamoyl)-2-(1-methyl-1H-pyrrol-2-yl)-vinyl]-amide::cid_5771244
SMILES CCN(CC)CCNC(=O)C(\NC(=O)c1cccs1)=C/c1cccn1C
InChI Key InChIKey=VKJDZDRYUUBSCY-JQIJEIRASA-N
Data  1 IC50
  Tab Delimited (TSV)   2D SDfile   Computed 3D by Vconf -m prep SDfile
Find this compound or compounds like it in BindingDB:
Activity Spreadsheet -- Enzyme Inhibition Constant Data from BindingDB
Found 1 hit for monomerid = 59436
TargetE3 ubiquitin-protein ligase XIAP(Homo sapiens (Human))
Sanford-Burnham Center For Chemical Genomics
Curated by PubChem BioAssay
LigandPNGBDBM59436(MLS000555323 | N-[(E)-1-[2-(diethylamino)ethylcarb...)
Affinity DataIC50:  1.00E+5nM. Assay description: Data Source: Sanford-Burnham Center for Chemical Genomics (SBCCG) Source Affiliation: Sanford-Burnham Medical Research Institute (SBMRI, San Diego, C...
In DepthDetails PCBioAssay