BDBM59505 2-[(1,1-diketothiolan-3-yl)amino]-N-(3,4-dimethylphenyl)acetamide::2-[[1,1-bis(oxidanylidene)thiolan-3-yl]amino]-N-(3,4-dimethylphenyl)ethanamide::MLS000771880::N-(3,4-dimethylphenyl)-2-[(1,1-dioxo-3-thiolanyl)amino]acetamide::N-(3,4-dimethylphenyl)-2-[(1,1-dioxothiolan-3-yl)amino]acetamide::SMR000344208::cid_4839937
SMILES Cc1ccc(NC(=O)CNC2CCS(=O)(=O)C2)cc1C
InChI Key InChIKey=XHEGZUCNHFQTIR-UHFFFAOYSA-N
Data  1 IC50
  Tab Delimited (TSV)   2D SDfile   Computed 3D by Vconf -m prep SDfile
Find this compound or compounds like it in BindingDB:
Activity Spreadsheet -- Enzyme Inhibition Constant Data from BindingDB
Found 1 hit for monomerid = 59505
TargetE3 ubiquitin-protein ligase XIAP(Homo sapiens (Human))
Sanford-Burnham Center For Chemical Genomics
Curated by PubChem BioAssay
LigandPNGBDBM59505(2-[(1,1-diketothiolan-3-yl)amino]-N-(3,4-dimethylp...)
Affinity DataIC50:  1.00E+5nM. Assay description: Data Source: Sanford-Burnham Center for Chemical Genomics (SBCCG) Source Affiliation: Sanford-Burnham Medical Research Institute (SBMRI, San Diego, C...
In DepthDetails PCBioAssay