BDBM59507 MLS001006868::N-[(4-phenoxybenzylidene)amino]carbamic acid ethyl ester::N-[(4-phenoxyphenyl)methylideneamino]carbamic acid ethyl ester::SMR000384419::cid_4587496::ethyl N-[(4-phenoxyphenyl)methylideneamino]carbamate
SMILES CCOC(=O)NN=Cc1ccc(Oc2ccccc2)cc1
InChI Key InChIKey=PGRGHDKSKHFSFM-UHFFFAOYSA-N
Data  1 IC50
  Tab Delimited (TSV)   2D SDfile   Computed 3D by Vconf -m prep SDfile
Find this compound or compounds like it in BindingDB:
Activity Spreadsheet -- Enzyme Inhibition Constant Data from BindingDB
Found 1 hit for monomerid = 59507
TargetE3 ubiquitin-protein ligase XIAP(Homo sapiens (Human))
Sanford-Burnham Center For Chemical Genomics
Curated by PubChem BioAssay
LigandPNGBDBM59507(MLS001006868 | N-[(4-phenoxybenzylidene)amino]carb...)
Affinity DataIC50:  1.00E+5nM. Assay description: Data Source: Sanford-Burnham Center for Chemical Genomics (SBCCG) Source Affiliation: Sanford-Burnham Medical Research Institute (SBMRI, San Diego, C...
In DepthDetails PCBioAssay