BDBM59523 4,5-dimethoxy-2-(2-thenoylamino)benzoic acid [2-(2,5-dimethyl-1-phenyl-pyrrol-3-yl)-2-keto-ethyl] ester::4,5-dimethoxy-2-[[oxo(thiophen-2-yl)methyl]amino]benzoic acid [2-(2,5-dimethyl-1-phenyl-3-pyrrolyl)-2-oxoethyl] ester::MLS000417254::SMR000264468::[2-(2,5-dimethyl-1-phenyl-pyrrol-3-yl)-2-oxidanylidene-ethyl] 4,5-dimethoxy-2-(thiophen-2-ylcarbonylamino)benzoate::[2-(2,5-dimethyl-1-phenylpyrrol-3-yl)-2-oxoethyl] 4,5-dimethoxy-2-(thiophene-2-carbonylamino)benzoate::cid_2483332
SMILES COc1cc(NC(=O)c2cccs2)c(cc1OC)C(=O)OCC(=O)c1cc(C)n(c1C)-c1ccccc1
InChI Key InChIKey=AOIKEDOQDAKUBK-UHFFFAOYSA-N
Data  1 IC50  1 EC50
  Tab Delimited (TSV)   2D SDfile   Computed 3D by Vconf -m prep SDfile
Find this compound or compounds like it in BindingDB:
Activity Spreadsheet -- Enzyme Inhibition Constant Data from BindingDB
Found 2 hits for monomerid = 59523
TargetTumor necrosis factor(Homo sapiens (Human))
Burnham Center For Chemical Genomics
Curated by PubChem BioAssay
LigandPNGBDBM59523(4,5-dimethoxy-2-(2-thenoylamino)benzoic acid [2-(2...)
Affinity DataIC50:  1.19E+3nM. Assay description: Data Source: Sanford-Burnham Center for Chemical Genomics (SBCCG) Source Affiliation: Sanford-Burnham Medical Research Institute (SBMRI, San Diego, C...
In DepthDetails PCBioAssay
TargetNucleotide-binding oligomerization domain-containing protein 1(Homo sapiens (Human))
Burnham Center For Chemical Genomics
Curated by PubChem BioAssay
LigandPNGBDBM59523(4,5-dimethoxy-2-(2-thenoylamino)benzoic acid [2-(2...)
Affinity DataEC50:  2.00E+4nM. Assay description: Data Source: Sanford-Burnham Center for Chemical Genomics (SBCCG) Source Affiliation: Sanford-Burnham Medical Research Institute (SBMRI, San Diego, C...
In DepthDetails PCBioAssay