BDBM59537 1-[2,5-dimethyl-1-(2-thenyl)pyrrol-3-yl]-2-[(2-nitro-3-pyridyl)oxy]ethanone::1-[2,5-dimethyl-1-(thiophen-2-ylmethyl)-3-pyrrolyl]-2-[(2-nitro-3-pyridinyl)oxy]ethanone::1-[2,5-dimethyl-1-(thiophen-2-ylmethyl)pyrrol-3-yl]-2-(2-nitropyridin-3-yl)oxy-ethanone::1-[2,5-dimethyl-1-(thiophen-2-ylmethyl)pyrrol-3-yl]-2-(2-nitropyridin-3-yl)oxyethanone::MLS001003845::SMR000377631::cid_4370338
SMILES Cc1cc(C(=O)COc2cccnc2[N+]([O-])=O)c(C)n1Cc1cccs1
InChI Key InChIKey=LRIVCHHVJWYYHR-UHFFFAOYSA-N
Data  1 IC50  1 EC50
  Tab Delimited (TSV)   2D SDfile   Computed 3D by Vconf -m prep SDfile
Find this compound or compounds like it in BindingDB:
Activity Spreadsheet -- Enzyme Inhibition Constant Data from BindingDB
Found 2 hits for monomerid = 59537
TargetTumor necrosis factor(Homo sapiens (Human))
Burnham Center For Chemical Genomics
Curated by PubChem BioAssay
LigandPNGBDBM59537(1-[2,5-dimethyl-1-(2-thenyl)pyrrol-3-yl]-2-[(2-nit...)
Affinity DataIC50:  2.00E+4nM. Assay description: Data Source: Sanford-Burnham Center for Chemical Genomics (SBCCG) Source Affiliation: Sanford-Burnham Medical Research Institute (SBMRI, San Diego, C...
In DepthDetails PCBioAssay
TargetNucleotide-binding oligomerization domain-containing protein 1(Homo sapiens (Human))
Burnham Center For Chemical Genomics
Curated by PubChem BioAssay
LigandPNGBDBM59537(1-[2,5-dimethyl-1-(2-thenyl)pyrrol-3-yl]-2-[(2-nit...)
Affinity DataEC50:  2.00E+4nM. Assay description: Data Source: Sanford-Burnham Center for Chemical Genomics (SBCCG) Source Affiliation: Sanford-Burnham Medical Research Institute (SBMRI, San Diego, C...
In DepthDetails PCBioAssay