BDBM59589 2-(5-Butyl-4-hydroxy-6-oxo-1,6-dihydro-pyrimidin-2-ylsulfanyl)-N-indan-5-yl-acetamide::2-[(5-butyl-4-hydroxy-6-keto-1H-pyrimidin-2-yl)thio]-N-indan-5-yl-acetamide::2-[(5-butyl-4-hydroxy-6-oxo-1H-pyrimidin-2-yl)sulfanyl]-N-(2,3-dihydro-1H-inden-5-yl)acetamide::2-[(5-butyl-4-hydroxy-6-oxo-1H-pyrimidin-2-yl)thio]-N-(2,3-dihydro-1H-inden-5-yl)acetamide::2-[(5-butyl-4-oxidanyl-6-oxidanylidene-1H-pyrimidin-2-yl)sulfanyl]-N-(2,3-dihydro-1H-inden-5-yl)ethanamide::MLS000074186::SMR000012852::cid_649767
SMILES CCCCc1c(O)nc(SCC(=O)Nc2ccc3CCCc3c2)[nH]c1=O
InChI Key InChIKey=NKYHYSLWBVXIHB-UHFFFAOYSA-N
Data  2 IC50
  Tab Delimited (TSV)   2D SDfile   Computed 3D by Vconf -m prep SDfile
Find this compound or compounds like it in BindingDB:
Activity Spreadsheet -- Enzyme Inhibition Constant Data from BindingDB
Found 2 hits for monomerid = 59589
TargetProcathepsin L(Homo sapiens (Human))
The Scripps Research Institute Molecular Screening Center
Curated by PubChem BioAssay
LigandPNGBDBM59589(2-(5-Butyl-4-hydroxy-6-oxo-1,6-dihydro-pyrimidin-2...)
Affinity DataIC50: >5.96E+4nM. Assay description: Source (MLPCN Center Name): The Scripps Research Institute Molecular Screening Center Affiliation: The Scripps Research Institute, TSRI Assay Provide...
In DepthDetails PCBioAssay
TargetM17 leucyl aminopeptidase(Plasmodium falciparum 3D7)
Srmlsc
Curated by PubChem BioAssay
LigandPNGBDBM59589(2-(5-Butyl-4-hydroxy-6-oxo-1,6-dihydro-pyrimidin-2...)
Affinity DataIC50:  7.61E+3nM. Assay description: Southern Research Molecular Libraries Screening Center (SRMLSC) Southern Research Institute (Birmingham, Alabama) NIH Molecular Libraries Screening...
In DepthDetails PCBioAssay