BDBM59644 7-[[5-(2,4-dimethylanilino)-1,3,4-thiadiazol-2-yl]sulfanylmethyl]-[1,3]thiazolo[3,2-a]pyrimidin-5-one::7-[[5-[(2,4-dimethylphenyl)amino]-1,3,4-thiadiazol-2-yl]sulfanylmethyl]-[1,3]thiazolo[3,2-a]pyrimidin-5-one::7-[[[5-(2,4-dimethylanilino)-1,3,4-thiadiazol-2-yl]thio]methyl]-5-thiazolo[3,2-a]pyrimidinone::7-[[[5-(2,4-dimethylanilino)-1,3,4-thiadiazol-2-yl]thio]methyl]thiazolo[3,2-a]pyrimidin-5-one::MLS000097573::SMR000063178::cid_2083638
SMILES Cc1ccc(Nc2nnc(SCc3cc(=O)n4ccsc4n3)s2)c(C)c1
InChI Key InChIKey=FELLCHJNIJXOJI-UHFFFAOYSA-N
Data  2 IC50
  Tab Delimited (TSV)   2D SDfile   Computed 3D by Vconf -m prep SDfile
Find this compound or compounds like it in BindingDB:
Activity Spreadsheet -- Enzyme Inhibition Constant Data from BindingDB
Found 2 hits for monomerid = 59644
TargetProcathepsin L(Homo sapiens (Human))
The Scripps Research Institute Molecular Screening Center
Curated by PubChem BioAssay
LigandPNGBDBM59644(7-[[5-(2,4-dimethylanilino)-1,3,4-thiadiazol-2-yl]...)
Affinity DataIC50: >5.96E+4nM. Assay description: Source (MLPCN Center Name): The Scripps Research Institute Molecular Screening Center Affiliation: The Scripps Research Institute, TSRI Assay Provide...
In DepthDetails PCBioAssay
TargetM17 leucyl aminopeptidase(Plasmodium falciparum 3D7)
Srmlsc
Curated by PubChem BioAssay
LigandPNGBDBM59644(7-[[5-(2,4-dimethylanilino)-1,3,4-thiadiazol-2-yl]...)
Affinity DataIC50:  6.49E+3nM. Assay description: Southern Research Molecular Libraries Screening Center (SRMLSC) Southern Research Institute (Birmingham, Alabama) NIH Molecular Libraries Screening...
In DepthDetails PCBioAssay