BDBM59683 MLS000093089::N-(3,4-dimethylphenyl)-2-[(4-keto-1,5,6,7-tetrahydrocyclopenta[d]pyrimidin-2-yl)thio]acetamide::N-(3,4-dimethylphenyl)-2-[(4-oxidanylidene-1,5,6,7-tetrahydrocyclopenta[d]pyrimidin-2-yl)sulfanyl]ethanamide::N-(3,4-dimethylphenyl)-2-[(4-oxo-1,5,6,7-tetrahydrocyclopenta[d]pyrimidin-2-yl)sulfanyl]acetamide::N-(3,4-dimethylphenyl)-2-[(4-oxo-1,5,6,7-tetrahydrocyclopenta[d]pyrimidin-2-yl)thio]acetamide::N-(3,4-dimethylphenyl)-2-[(4-oxo-4,5,6,7-tetrahydro-3H-cyclopenta[d]pyrimidin-2-yl)thio]acetamide::SMR000028718::cid_3244131
SMILES Cc1ccc(NC(=O)CSc2nc3CCCc3c(=O)[nH]2)cc1C
InChI Key InChIKey=YYIYXEPVLATWBB-UHFFFAOYSA-N
Data  2 IC50
  Tab Delimited (TSV)   2D SDfile   Computed 3D by Vconf -m prep SDfile
Find this compound or compounds like it in BindingDB:
Activity Spreadsheet -- Enzyme Inhibition Constant Data from BindingDB
Found 2 hits for monomerid = 59683
TargetProcathepsin L(Homo sapiens (Human))
The Scripps Research Institute Molecular Screening Center
Curated by PubChem BioAssay
LigandPNGBDBM59683(MLS000093089 | N-(3,4-dimethylphenyl)-2-[(4-keto-1...)
Affinity DataIC50: >5.96E+4nM. Assay description: Source (MLPCN Center Name): The Scripps Research Institute Molecular Screening Center Affiliation: The Scripps Research Institute, TSRI Assay Provide...
In DepthDetails PCBioAssay
TargetM17 leucyl aminopeptidase(Plasmodium falciparum 3D7)
Srmlsc
Curated by PubChem BioAssay
LigandPNGBDBM59683(MLS000093089 | N-(3,4-dimethylphenyl)-2-[(4-keto-1...)
Affinity DataIC50:  5.90E+3nM. Assay description: Southern Research Molecular Libraries Screening Center (SRMLSC) Southern Research Institute (Birmingham, Alabama) NIH Molecular Libraries Screening...
In DepthDetails PCBioAssay