BDBM59826 5-chloranyl-3H-1,3-benzothiazole-2-thione::5-chloro-3H-1,3-benzothiazole-2-thione::MLS000518963::SMR000129383::cid_2723842
SMILES Sc1nc2cc(Cl)ccc2s1
InChI Key InChIKey=NKYDKCVZNMNZCM-UHFFFAOYSA-N
Data  2 IC50  1 EC50
  Tab Delimited (TSV)   2D SDfile   Computed 3D by Vconf -m prep SDfile
Find this compound or compounds like it in BindingDB:
Activity Spreadsheet -- Enzyme Inhibition Constant Data from BindingDB
Found 3 hits for monomerid = 59826
TargetM17 leucyl aminopeptidase(Plasmodium falciparum 3D7)
Srmlsc
Curated by PubChem BioAssay
LigandPNGBDBM59826(5-chloranyl-3H-1,3-benzothiazole-2-thione | 5-chlo...)
Affinity DataIC50:  1.48E+4nM. Assay description: Southern Research Molecular Libraries Screening Center (SRMLSC) Southern Research Institute (Birmingham, Alabama) NIH Molecular Libraries Screening...
In DepthDetails PCBioAssay
TargetProteasome subunit beta type-8(Homo sapiens (Human))
Hungarian Academy Of Sciences
Curated by ChEMBL
LigandPNGBDBM59826(5-chloranyl-3H-1,3-benzothiazole-2-thione | 5-chlo...)
Affinity DataIC50:  3.20E+4nM. Assay description: Inhibition of human chymotrypsin-like beta 5i subunit of iCP using suc-LLVY-AMC as flurogenic substrate for 90 mins by fluorescence-based assay
In DepthDetails ArticlePubMed
TargetMitochondrial peptide methionine sulfoxide reductase(Bos taurus)
The Scripps Research Institute Molecular Screening Center
Curated by PubChem BioAssay
LigandPNGBDBM59826(5-chloranyl-3H-1,3-benzothiazole-2-thione | 5-chlo...)
Affinity DataEC50: >1.04E+5nM. Assay description: Source (MLPCN Center Name): The Scripps Research Institute Molecular Screening Center (SRIMSC) Affiliation: The Scripps Research Institute, TSRI Assa...
In DepthDetails PCBioAssay