BDBM59882 6-({[3-(ethoxycarbonyl)-4-(4-methylphenyl)-2-thienyl]amino}carbonyl)-3-cyclohexene-1-carboxylic acid::6-[[3-carbethoxy-4-(p-tolyl)-2-thienyl]carbamoyl]cyclohex-3-ene-1-carboxylic acid::6-[[3-ethoxycarbonyl-4-(4-methylphenyl)thiophen-2-yl]carbamoyl]cyclohex-3-ene-1-carboxylic acid::6-[[[3-ethoxycarbonyl-4-(4-methylphenyl)-2-thiophenyl]amino]-oxomethyl]-1-cyclohex-3-enecarboxylic acid::MLS000540051::SMR000162178::cid_2887241
SMILES CCOC(=O)c1c(NC(=O)C2CC=CCC2C(O)=O)scc1-c1ccc(C)cc1
InChI Key InChIKey=WCKFQTUDRVHYPL-UHFFFAOYSA-N
Data  2 IC50
  Tab Delimited (TSV)   2D SDfile   Computed 3D by Vconf -m prep SDfile
Find this compound or compounds like it in BindingDB:
Activity Spreadsheet -- Enzyme Inhibition Constant Data from BindingDB
Found 2 hits for monomerid = 59882
TargetProcathepsin L(Homo sapiens (Human))
The Scripps Research Institute Molecular Screening Center
Curated by PubChem BioAssay
LigandPNGBDBM59882(6-({[3-(ethoxycarbonyl)-4-(4-methylphenyl)-2-thien...)
Affinity DataIC50: >5.96E+4nM. Assay description: Source (MLPCN Center Name): The Scripps Research Institute Molecular Screening Center Affiliation: The Scripps Research Institute, TSRI Assay Provide...
In DepthDetails PCBioAssay
TargetM17 leucyl aminopeptidase(Plasmodium falciparum 3D7)
Srmlsc
Curated by PubChem BioAssay
LigandPNGBDBM59882(6-({[3-(ethoxycarbonyl)-4-(4-methylphenyl)-2-thien...)
Affinity DataIC50:  4.80E+3nM. Assay description: Southern Research Molecular Libraries Screening Center (SRMLSC) Southern Research Institute (Birmingham, Alabama) NIH Molecular Libraries Screening...
In DepthDetails PCBioAssay