BDBM60040 2-keto-1H-pyridine-3-carboxylic acid [2-[1-(3,4-dimethylphenyl)-2,5-dimethyl-pyrrol-3-yl]-2-keto-ethyl] ester::2-oxo-1H-pyridine-3-carboxylic acid [2-[1-(3,4-dimethylphenyl)-2,5-dimethyl-3-pyrrolyl]-2-oxoethyl] ester::MLS000416793::SMR000241848::[2-[1-(3,4-dimethylphenyl)-2,5-dimethyl-pyrrol-3-yl]-2-oxidanylidene-ethyl] 2-oxidanylidene-1H-pyridine-3-carboxylate::[2-[1-(3,4-dimethylphenyl)-2,5-dimethylpyrrol-3-yl]-2-oxoethyl] 2-oxo-1H-pyridine-3-carboxylate::cid_2565369
SMILES Cc1cc(C(=O)COC(=O)c2ccc[nH]c2=O)c(C)n1-c1ccc(C)c(C)c1
InChI Key InChIKey=YHVNCMXSOYCCJG-UHFFFAOYSA-N
Data  2 IC50
  Tab Delimited (TSV)   2D SDfile   Computed 3D by Vconf -m prep SDfile
Find this compound or compounds like it in BindingDB:
Activity Spreadsheet -- Enzyme Inhibition Constant Data from BindingDB
Found 2 hits for monomerid = 60040
TargetProcathepsin L(Homo sapiens (Human))
The Scripps Research Institute Molecular Screening Center
Curated by PubChem BioAssay
LigandPNGBDBM60040(2-keto-1H-pyridine-3-carboxylic acid [2-[1-(3,4-di...)
Affinity DataIC50: >5.96E+4nM. Assay description: Source (MLPCN Center Name): The Scripps Research Institute Molecular Screening Center Affiliation: The Scripps Research Institute, TSRI Assay Provide...
In DepthDetails PCBioAssay
TargetM17 leucyl aminopeptidase(Plasmodium falciparum 3D7)
Srmlsc
Curated by PubChem BioAssay
LigandPNGBDBM60040(2-keto-1H-pyridine-3-carboxylic acid [2-[1-(3,4-di...)
Affinity DataIC50:  1.45E+3nM. Assay description: Southern Research Molecular Libraries Screening Center (SRMLSC) Southern Research Institute (Birmingham, Alabama) NIH Molecular Libraries Screening...
In DepthDetails PCBioAssay