BDBM60087 2-[4-[(3-chlorophenyl)carbamoylamino]phenyl]acetic acid::2-[4-[(3-chlorophenyl)carbamoylamino]phenyl]ethanoic acid::2-[4-[[(3-chloroanilino)-oxomethyl]amino]phenyl]acetic acid::MLS000663274::SMR000301310::[4-({[(3-chlorophenyl)amino]carbonyl}amino)phenyl]acetic acid::cid_6465785
SMILES OC(=O)Cc1ccc(NC(=O)Nc2cccc(Cl)c2)cc1
InChI Key InChIKey=IGDFOGHRTZOXND-UHFFFAOYSA-N
Data  2 IC50
  Tab Delimited (TSV)   2D SDfile   Computed 3D by Vconf -m prep SDfile
Find this compound or compounds like it in BindingDB:
Activity Spreadsheet -- Enzyme Inhibition Constant Data from BindingDB
Found 2 hits for monomerid = 60087
TargetProcathepsin L(Homo sapiens (Human))
The Scripps Research Institute Molecular Screening Center
Curated by PubChem BioAssay
LigandPNGBDBM60087(2-[4-[(3-chlorophenyl)carbamoylamino]phenyl]acetic...)
Affinity DataIC50: >5.96E+4nM. Assay description: Source (MLPCN Center Name): The Scripps Research Institute Molecular Screening Center Affiliation: The Scripps Research Institute, TSRI Assay Provide...
In DepthDetails PCBioAssay
TargetM17 leucyl aminopeptidase(Plasmodium falciparum 3D7)
Srmlsc
Curated by PubChem BioAssay
LigandPNGBDBM60087(2-[4-[(3-chlorophenyl)carbamoylamino]phenyl]acetic...)
Affinity DataIC50:  1.70E+3nM. Assay description: Southern Research Molecular Libraries Screening Center (SRMLSC) Southern Research Institute (Birmingham, Alabama) NIH Molecular Libraries Screening...
In DepthDetails PCBioAssay