BDBM60138 (Z)-2-cyano-3-[5-(diethylamino)-2-furanyl]-N-propan-2-yl-2-propenamide::(Z)-2-cyano-3-[5-(diethylamino)-2-furyl]-N-isopropyl-acrylamide::(Z)-2-cyano-3-[5-(diethylamino)furan-2-yl]-N-propan-2-yl-prop-2-enamide::(Z)-2-cyano-3-[5-(diethylamino)furan-2-yl]-N-propan-2-ylprop-2-enamide::MLS000687453::SMR000283490::cid_798427
SMILES CCN(CC)c1ccc(\C=C(\C#N)C(=O)NC(C)C)o1
InChI Key InChIKey=JSMPOXBCHJLHNB-XFXZXTDPSA-N
Data  2 IC50
  Tab Delimited (TSV)   2D SDfile   Computed 3D by Vconf -m prep SDfile
Find this compound or compounds like it in BindingDB:
Activity Spreadsheet -- Enzyme Inhibition Constant Data from BindingDB
Found 2 hits for monomerid = 60138
TargetInsulin-degrading enzyme(Homo sapiens (Human))
The Scripps Research Institute Molecular Screening Center
Curated by PubChem BioAssay
LigandPNGBDBM60138((Z)-2-cyano-3-[5-(diethylamino)-2-furanyl]-N-propa...)
Affinity DataIC50:  1.32E+4nM. Assay description: Source (MLPCN Center Name): The Scripps Research Institute Molecular Screening Center (SRIMSC) Center Affiliation: The Scripps Research Institute (TS...
In DepthDetails PCBioAssay
TargetM17 leucyl aminopeptidase(Plasmodium falciparum 3D7)
Srmlsc
Curated by PubChem BioAssay
LigandPNGBDBM60138((Z)-2-cyano-3-[5-(diethylamino)-2-furanyl]-N-propa...)
Affinity DataIC50:  6.58E+4nM. Assay description: Southern Research Molecular Libraries Screening Center (SRMLSC) Southern Research Institute (Birmingham, Alabama) NIH Molecular Libraries Screening...
In DepthDetails PCBioAssay