BDBM60249 3,5-dinitro-N'-[(1E)-pyridin-2-ylmethylene]benzohydrazide::3,5-dinitro-N-(2-pyridinylmethylideneamino)benzamide::3,5-dinitro-N-(2-pyridylmethyleneamino)benzamide::3,5-dinitro-N-(pyridin-2-ylmethylideneamino)benzamide::MLS000720075::SMR000304604::cid_16193305
SMILES [O-][N+](=O)c1cc(cc(c1)[N+]([O-])=O)C(=O)N\N=C\c1ccccn1
InChI Key InChIKey=AOXPIPLNHJRYIZ-OVCLIPMQSA-N
Data  3 IC50
  Tab Delimited (TSV)   2D SDfile   Computed 3D by Vconf -m prep SDfile
Find this compound or compounds like it in BindingDB:
Activity Spreadsheet -- Enzyme Inhibition Constant Data from BindingDB
Found 3 hits for monomerid = 60249
TargetKappa-type opioid receptor(Homo sapiens (Human))
Burnham Center For Chemical Genomics
Curated by PubChem BioAssay
LigandPNGBDBM60249(3,5-dinitro-N'-[(1E)-pyridin-2-ylmethylene]ben...)
Affinity DataIC50:  4.93E+3nM. Assay description: Data Source: Sanford-Burnham Center for Chemical Genomics (SBCCG) Source Affiliation: Sanford-Burnham Medical Research Institute (SBMRI, San Diego, C...
In DepthDetails PCBioAssay
TargetType-1 angiotensin II receptor(Homo sapiens (Human))
Burnham Center For Chemical Genomics
Curated by PubChem BioAssay
LigandPNGBDBM60249(3,5-dinitro-N'-[(1E)-pyridin-2-ylmethylene]ben...)
Affinity DataIC50:  4.07E+3nM. Assay description: Data Source: Sanford-Burnham Center for Chemical Genomics (SBCCG) Source Affiliation: Sanford-Burnham Medical Research Institute(SBMRI, San Diego, C...
In DepthDetails PCBioAssay
TargetApelin receptor(Homo sapiens (Human))
Sanford-Burnham Center For Chemical Genomics
Curated by PubChem BioAssay
LigandPNGBDBM60249(3,5-dinitro-N'-[(1E)-pyridin-2-ylmethylene]ben...)
Affinity DataIC50:  9.72E+3nM. Assay description: Data Source: Sanford-Burnham Center for Chemical Genomics (SBCCG) Source Affiliation: Sanford- Sanford-Burnham Medical Research Institute(SBMRI, San...
In DepthDetails PCBioAssay