BDBM60299 3-(1-naphthalenylmethyl)-4-phenyl-1H-1,2,4-triazole-5-thione::3-(1-naphthylmethyl)-4-phenyl-1H-1,2,4-triazole-5-thione::3-(naphthalen-1-ylmethyl)-4-phenyl-1H-1,2,4-triazole-5-thione::5-(1-naphthylmethyl)-4-phenyl-4H-1,2,4-triazole-3-thiol::MLS000535330::SMR000142766::cid_695110
SMILES S=c1[nH]nc(Cc2cccc3ccccc23)n1-c1ccccc1
InChI Key InChIKey=HIUZRQOFJKBKDH-UHFFFAOYSA-N
Data  1 IC50
  Tab Delimited (TSV)   2D SDfile   Computed 3D by Vconf -m prep SDfile
Find this compound or compounds like it in BindingDB:
Activity Spreadsheet -- Enzyme Inhibition Constant Data from BindingDB
Found 1 hit for monomerid = 60299
TargetPlectin(Homo sapiens (Human))
Burnham Center For Chemical Genomics
Curated by PubChem BioAssay
LigandPNGBDBM60299(3-(1-naphthalenylmethyl)-4-phenyl-1H-1,2,4-triazol...)
Affinity DataIC50:  2.00E+5nM. Assay description: Data Source: Sanford-Burnham Center for Chemical Genomics (SBCCG) Source Affiliation: Sanford-Burnham Medical Research Institute (SBMRI, San Diego, C...
In DepthDetails PCBioAssay