BDBM60306 2-[2-(4-methylphenyl)-2-oxidanylidene-ethoxy]-N-phenyl-benzamide::2-[2-(4-methylphenyl)-2-oxoethoxy]-N-phenylbenzamide::2-[2-keto-2-(p-tolyl)ethoxy]-N-phenyl-benzamide::MLS000582644::SMR000201344::cid_1218686
SMILES Cc1ccc(cc1)C(=O)COc1ccccc1C(=O)Nc1ccccc1
InChI Key InChIKey=NNANDQTUQDGXHX-UHFFFAOYSA-N
Data  1 IC50
  Tab Delimited (TSV)   2D SDfile   Computed 3D by Vconf -m prep SDfile
Find this compound or compounds like it in BindingDB:
Activity Spreadsheet -- Enzyme Inhibition Constant Data from BindingDB
Found 1 hit for monomerid = 60306
TargetPlectin(Homo sapiens (Human))
Burnham Center For Chemical Genomics
Curated by PubChem BioAssay
LigandPNGBDBM60306(2-[2-(4-methylphenyl)-2-oxidanylidene-ethoxy]-N-ph...)
Affinity DataIC50:  2.00E+5nM. Assay description: Data Source: Sanford-Burnham Center for Chemical Genomics (SBCCG) Source Affiliation: Sanford-Burnham Medical Research Institute (SBMRI, San Diego, C...
In DepthDetails PCBioAssay