BDBM60317 1-[3-(2-furanylmethylthio)-4-nitrophenyl]-4-methylsulfonylpiperazine::1-[3-(2-furfurylthio)-4-nitro-phenyl]-4-mesyl-piperazine::1-[3-(furan-2-ylmethylsulfanyl)-4-nitro-phenyl]-4-methylsulfonyl-piperazine::1-[3-(furan-2-ylmethylsulfanyl)-4-nitrophenyl]-4-methylsulfonylpiperazine::1-{3-[(2-furylmethyl)thio]-4-nitrophenyl}-4-(methylsulfonyl)piperazine::MLS000690632::SMR000298888::cid_2920087
SMILES CS(=O)(=O)N1CCN(CC1)c1ccc(c(SCc2ccco2)c1)[N+]([O-])=O
InChI Key InChIKey=MKKOSSJRCYHYPB-UHFFFAOYSA-N
Data  1 IC50
  Tab Delimited (TSV)   2D SDfile   Computed 3D by Vconf -m prep SDfile
Find this compound or compounds like it in BindingDB:
Activity Spreadsheet -- Enzyme Inhibition Constant Data from BindingDB
Found 1 hit for monomerid = 60317
TargetPlectin(Homo sapiens (Human))
Burnham Center For Chemical Genomics
Curated by PubChem BioAssay
LigandPNGBDBM60317(1-[3-(2-furanylmethylthio)-4-nitrophenyl]-4-methyl...)
Affinity DataIC50:  2.00E+5nM. Assay description: Data Source: Sanford-Burnham Center for Chemical Genomics (SBCCG) Source Affiliation: Sanford-Burnham Medical Research Institute (SBMRI, San Diego, C...
In DepthDetails PCBioAssay