BDBM60318 MLS000711131::N-(2,4-dimethylphenyl)-4-[2-(2-nitrobenzoyl)hydrazinyl]-4-oxobutanamide::N-(2,4-dimethylphenyl)-4-[2-(2-nitrophenyl)carbonylhydrazinyl]-4-oxidanylidene-butanamide::N-(2,4-dimethylphenyl)-4-[[(2-nitrophenyl)-oxomethyl]hydrazo]-4-oxobutanamide::N-(2,4-dimethylphenyl)-4-keto-4-[N'-(2-nitrobenzoyl)hydrazino]butyramide::SMR000280898::cid_3140677
SMILES Cc1ccc(NC(=O)CCC(=O)NNC(=O)c2ccccc2[N+]([O-])=O)c(C)c1
InChI Key InChIKey=YMWNJJZLZYPBKS-UHFFFAOYSA-N
Data  1 IC50
  Tab Delimited (TSV)   2D SDfile   Computed 3D by Vconf -m prep SDfile
Find this compound or compounds like it in BindingDB:
Activity Spreadsheet -- Enzyme Inhibition Constant Data from BindingDB
Found 1 hit for monomerid = 60318
TargetPlectin(Homo sapiens (Human))
Burnham Center For Chemical Genomics
Curated by PubChem BioAssay
LigandPNGBDBM60318(MLS000711131 | N-(2,4-dimethylphenyl)-4-[2-(2-nitr...)
Affinity DataIC50:  2.00E+5nM. Assay description: Data Source: Sanford-Burnham Center for Chemical Genomics (SBCCG) Source Affiliation: Sanford-Burnham Medical Research Institute (SBMRI, San Diego, C...
In DepthDetails PCBioAssay