BDBM60356 MLS000037872::N,N-dimethyl-4-[(E)-2-(1-oxidanidylpyridin-1-ium-4-yl)ethenyl]aniline::N,N-dimethyl-4-[(E)-2-(1-oxido-4-pyridin-1-iumyl)ethenyl]aniline::N,N-dimethyl-4-[(E)-2-(1-oxidopyridin-1-ium-4-yl)ethenyl]aniline::SMR000038452::cid_910585::dimethyl-[4-[(E)-2-(1-oxidopyridin-1-ium-4-yl)vinyl]phenyl]amine
SMILES CN(C)c1ccc(\C=C\c2cc[n+]([O-])cc2)cc1
InChI Key InChIKey=ZNBFFDGZGHFAOU-ONEGZZNKSA-N
Data  1 IC50
  Tab Delimited (TSV)   2D SDfile   Computed 3D by Vconf -m prep SDfile
Find this compound or compounds like it in BindingDB:
Activity Spreadsheet -- Enzyme Inhibition Constant Data from BindingDB
Found 1 hit for monomerid = 60356
TargetLarge T antigen(Simian virus 40)
Southern Research Specialized Biocontainment Screening Center
Curated by PubChem BioAssay
LigandPNGBDBM60356(MLS000037872 | N,N-dimethyl-4-[(E)-2-(1-oxidanidyl...)
Affinity DataIC50:  1.14E+4nM. Assay description: A biochemical assay using the ADP-Hunter methodology, purified TAg, and ATP to identify compounds that inhibit the ATPase activity of Tag Southern Re...
In DepthDetails PCBioAssay