BDBM60561 3-[2-[(E)-(3-methoxy-4-oxidanylidene-cyclohexa-2,5-dien-1-ylidene)methyl]hydrazinyl]indol-2-one::3-[2-[(E)-(3-methoxy-4-oxocyclohexa-2,5-dien-1-ylidene)methyl]hydrazinyl]indol-2-one::3-[N'-[(E)-(4-keto-3-methoxy-cyclohexa-2,5-dien-1-ylidene)methyl]hydrazino]indol-2-one::3-[[(E)-(3-methoxy-4-oxo-1-cyclohexa-2,5-dienylidene)methyl]hydrazo]-2-indolone::MLS000417015::SMR000241970::cid_15945299
SMILES COc1cc(C=NNC2=c3ccccc3=NC2=O)ccc1O
InChI Key InChIKey=GWBCIDJFKIVNAA-UHFFFAOYSA-N
Data  1 EC50
  Tab Delimited (TSV)   2D SDfile   Computed 3D by Vconf -m prep SDfile
Find this compound or compounds like it in BindingDB:
Activity Spreadsheet -- Enzyme Inhibition Constant Data from BindingDB
Found 1 hit for monomerid = 60561
TargetSerine/threonine-protein kinase 33(Homo sapiens (Human))
Broad Institute
Curated by PubChem BioAssay
LigandPNGBDBM60561(3-[2-[(E)-(3-methoxy-4-oxidanylidene-cyclohexa-2,5...)
Affinity DataEC50:  9.23E+3nM. Assay description: Keywords: STK33 Kinase, Non-ATP Competitive Inhibitor Assay Overview: Purified STK33 Kinase is preincubated with potential inhibitors and allowed to ...
In DepthDetails PCBioAssay