BDBM60593 6-fluoranyl-1,2-benzothiazol-3-one::6-fluoro-1,2-benzisothiazol-3(2H)-one::6-fluoro-1,2-benzothiazol-3-one::MLS000729298::SMR000307576::cid_480272
SMILES Fc1ccc2c(c1)s[nH]c2=O
InChI Key InChIKey=WLQRIPHXCTXOQC-UHFFFAOYSA-N
Data  5 IC50  2 EC50
  Tab Delimited (TSV)   2D SDfile   Computed 3D by Vconf -m prep SDfile
Find this compound or compounds like it in BindingDB:
Activity Spreadsheet -- Enzyme Inhibition Constant Data from BindingDB
Found 7 hits for monomerid = 60593
TargetGlucose-6-phosphate 1-dehydrogenase(Homo sapiens (Human))
Burnham Center For Chemical Genomics
Curated by PubChem BioAssay
LigandPNGBDBM60593(6-fluoranyl-1,2-benzothiazol-3-one | 6-fluoro-1,2-...)
Affinity DataIC50: >8.00E+4nM. Assay description: Data Source: Sanford-Burnham Center for Chemical Genomics (SBCCG) Source Affiliation: Sanford-Burnham Medical Research Institute (SBMRI, San Diego CA...
In DepthDetails PCBioAssay
TargetGlucose-6-phosphate dehydrogenase-6-phosphogluconolactonase(Plasmodium falciparum 3D7)
Burnham Center For Chemical Genomics
Curated by PubChem BioAssay
LigandPNGBDBM60593(6-fluoranyl-1,2-benzothiazol-3-one | 6-fluoro-1,2-...)
Affinity DataIC50:  9.86E+3nM. Assay description: Data Source: Sanford-Burnham Center for Chemical Genomics (SBCCG) Source Affiliation: Sanford-Burnham Medical Research Institute (SBMRI, San Diego CA...
In DepthDetails PCBioAssay
TargetGlucose-6-phosphate dehydrogenase-6-phosphogluconolactonase(Plasmodium falciparum 3D7)
Burnham Center For Chemical Genomics
Curated by PubChem BioAssay
LigandPNGBDBM60593(6-fluoranyl-1,2-benzothiazol-3-one | 6-fluoro-1,2-...)
Affinity DataIC50: >8.00E+4nM. Assay description: Data Source: Sanford-Burnham Center for Chemical Genomics (SBCCG) Source Affiliation: Sanford-Burnham Medical Research Institute (SBMRI, San Diego CA...
In DepthDetails PCBioAssay
TargetReplicase polyprotein 1ab(2019-nCoV)
Nanjing University Of Chinese Medicine
Curated by ChEMBL
LigandPNGBDBM60593(6-fluoranyl-1,2-benzothiazol-3-one | 6-fluoro-1,2-...)
Affinity DataIC50:  2.29E+3nM. Assay description: Inhibition of SARS-CoV-2 main protease using Mca-AVLQSGFRK(Dnp)K as substrate preincubated with enzyme for 10 mins followed by substrate addition and...
In DepthDetails PubMed
TargetMitochondrial peptide methionine sulfoxide reductase(Bos taurus)
The Scripps Research Institute Molecular Screening Center
Curated by PubChem BioAssay
LigandPNGBDBM60593(6-fluoranyl-1,2-benzothiazol-3-one | 6-fluoro-1,2-...)
Affinity DataEC50: >1.04E+5nM. Assay description: Source (MLPCN Center Name): The Scripps Research Institute Molecular Screening Center (SRIMSC) Affiliation: The Scripps Research Institute, TSRI Assa...
In DepthDetails PCBioAssay
TargetProbable global transcription activator SNF2L2(Homo sapiens (Human))
The Scripps Research Institute Molecular Screening Center
Curated by PubChem BioAssay
LigandPNGBDBM60593(6-fluoranyl-1,2-benzothiazol-3-one | 6-fluoro-1,2-...)
Affinity DataEC50:  9.11E+4nM
In DepthDetails PCBioAssay
TargetGlucose-6-phosphate dehydrogenase-6-phosphogluconolactonase(Plasmodium falciparum 3D7)
Burnham Center For Chemical Genomics
Curated by PubChem BioAssay
LigandPNGBDBM60593(6-fluoranyl-1,2-benzothiazol-3-one | 6-fluoro-1,2-...)
Affinity DataIC50:  5.62E+4nM. Assay description: Data Source: Sanford-Burnham Center for Chemical Genomics (SBCCG) Source Affiliation: Sanford-Burnham Medical Research Institute (SBMRI, San Diego CA...
In DepthDetails PCBioAssay