BDBM61088 (5-methyl-2-propan-2-yl-cyclohexyl) 2-[3-methyl-2-(phenoxymethyl)benzimidazol-3-ium-1-yl]ethanoate;chloride::(5-methyl-2-propan-2-ylcyclohexyl) 2-[3-methyl-2-(phenoxymethyl)benzimidazol-3-ium-1-yl]acetate;chloride::1-{2-[(2-isopropyl-5-methylcyclohexyl)oxy]-2-oxoethyl}-3-methyl-2-(phenoxymethyl)-1H-3,1-benzimidazol-3-ium::2-[3-methyl-2-(phenoxymethyl)-1-benzimidazol-3-iumyl]acetic acid (5-methyl-2-propan-2-ylcyclohexyl) ester;chloride::2-[3-methyl-2-(phenoxymethyl)benzimidazol-3-ium-1-yl]acetic acid (2-isopropyl-5-methyl-cyclohexyl) ester;chloride::MLS000766718::SMR000339614::cid_2834419
SMILES CC(C)C1CCC(C)CC1OC(=O)Cn1c(COc2ccccc2)[n+](C)c2ccccc12
InChI Key InChIKey=HACNGQQLOZYIEB-UHFFFAOYSA-N
Data  2 EC50
  Tab Delimited (TSV)   2D SDfile   Computed 3D by Vconf -m prep SDfile
Find this compound or compounds like it in BindingDB:
Activity Spreadsheet -- Enzyme Inhibition Constant Data from BindingDB
Found 2 hits for monomerid = 61088
TargetNeurotensin receptor type 1(Homo sapiens (Human))
Burnham Center For Chemical Genomics
Curated by PubChem BioAssay
LigandPNGBDBM61088((5-methyl-2-propan-2-yl-cyclohexyl) 2-[3-methyl-2-...)
Affinity DataEC50:  1.40E+4nM. Assay description: Data Source: Sanford-Burnham Center for Chemical Genomics (SBCCG) Source Affiliation: Sanford-Burnham Medical Research Institute (SBMRI, San Diego, C...
In DepthDetails PCBioAssay
TargetG-protein coupled receptor 55(Homo sapiens (Human))
Burnham Center For Chemical Genomics
Curated by PubChem BioAssay
LigandPNGBDBM61088((5-methyl-2-propan-2-yl-cyclohexyl) 2-[3-methyl-2-...)
Affinity DataEC50:  3.20E+4nM. Assay description: Data Source: Sanford-Burnham Center for Chemical Genomics (SBCCG) Source Affiliation: Sanford-Burnham Medical Research Institute (SBMRI, San Diego, C...
In DepthDetails PCBioAssay