BDBM61124 1-isobutyl-4-[(1S)-3-methyl-1-[(phenylthio)methyl]butyl]-1,4-diazepan-5-one::4-[(2S)-4-methyl-1-(phenylthio)pentan-2-yl]-1-(2-methylpropyl)-1,4-diazepan-5-one::4-[(2S)-4-methyl-1-phenylsulfanyl-pentan-2-yl]-1-(2-methylpropyl)-1,4-diazepan-5-one::4-[(2S)-4-methyl-1-phenylsulfanylpentan-2-yl]-1-(2-methylpropyl)-1,4-diazepan-5-one::MLS000881462::SMR000545002::cid_24761314
SMILES CC(C)C[C@@H](CSc1ccccc1)N1CCN(CC(C)C)CCC1=O
InChI Key InChIKey=HFRYUMKLTMJXMI-IBGZPJMESA-N
Data  1 EC50
  Tab Delimited (TSV)   2D SDfile   Computed 3D by Vconf -m prep SDfile
Find this compound or compounds like it in BindingDB:
Activity Spreadsheet -- Enzyme Inhibition Constant Data from BindingDB
Found 1 hit for monomerid = 61124
TargetG-protein coupled receptor 55(Homo sapiens (Human))
Burnham Center For Chemical Genomics
Curated by PubChem BioAssay
LigandPNGBDBM61124(1-isobutyl-4-[(1S)-3-methyl-1-[(phenylthio)methyl]...)
Affinity DataEC50:  1.41E+4nM. Assay description: Data Source: Sanford-Burnham Center for Chemical Genomics (SBCCG) Source Affiliation: Sanford-Burnham Medical Research Institute (SBMRI, San Diego, C...
In DepthDetails PCBioAssay