BDBM61126 2-(3-bromobenzyl)-6-(2,5-dimethylphenyl)pyridazin-3(2H)-one::2-(3-bromobenzyl)-6-(2,5-dimethylphenyl)pyridazin-3-one::2-[(3-bromophenyl)methyl]-6-(2,5-dimethylphenyl)-3-pyridazinone::2-[(3-bromophenyl)methyl]-6-(2,5-dimethylphenyl)pyridazin-3-one::MLS001200358::SMR000563460::cid_23608901
SMILES Cc1ccc(C)c(c1)-c1ccc(=O)n(Cc2cccc(Br)c2)n1
InChI Key InChIKey=HZXOTOPJRGQSJQ-UHFFFAOYSA-N
Data  1 EC50
  Tab Delimited (TSV)   2D SDfile   Computed 3D by Vconf -m prep SDfile
Find this compound or compounds like it in BindingDB:
Activity Spreadsheet -- Enzyme Inhibition Constant Data from BindingDB
Found 1 hit for monomerid = 61126
TargetG-protein coupled receptor 55(Homo sapiens (Human))
Burnham Center For Chemical Genomics
Curated by PubChem BioAssay
LigandPNGBDBM61126(2-(3-bromobenzyl)-6-(2,5-dimethylphenyl)pyridazin-...)
Affinity DataEC50:  3.48E+3nM. Assay description: Data Source: Sanford-Burnham Center for Chemical Genomics (SBCCG) Source Affiliation: Sanford-Burnham Medical Research Institute (SBMRI, San Diego, C...
In DepthDetails PCBioAssay