BDBM61147 MLS001079048::N-(2-isopropoxy-5-morpholinosulfonyl-phenyl)-4-(2-ketopyrrolidino)benzamide::N-(5-morpholin-4-ylsulfonyl-2-propan-2-yloxy-phenyl)-4-(2-oxidanylidenepyrrolidin-1-yl)benzamide::N-(5-morpholin-4-ylsulfonyl-2-propan-2-yloxyphenyl)-4-(2-oxopyrrolidin-1-yl)benzamide::N-[5-(4-morpholinylsulfonyl)-2-propan-2-yloxyphenyl]-4-(2-oxo-1-pyrrolidinyl)benzamide::SMR000713161::cid_24816860
SMILES CC(C)Oc1ccc(cc1NC(=O)c1ccc(cc1)N1CCCC1=O)S(=O)(=O)N1CCOCC1
InChI Key InChIKey=YXWKIWOKIYMBMA-UHFFFAOYSA-N
Data  2 IC50  2 EC50
  Tab Delimited (TSV)   2D SDfile   Computed 3D by Vconf -m prep SDfile
Find this compound or compounds like it in BindingDB:
Activity Spreadsheet -- Enzyme Inhibition Constant Data from BindingDB
Found 4 hits for monomerid = 61147
TargetG-protein coupled receptor 55(Homo sapiens (Human))
Burnham Center For Chemical Genomics
Curated by PubChem BioAssay
LigandPNGBDBM61147(MLS001079048 | N-(2-isopropoxy-5-morpholinosulfony...)
Affinity DataEC50:  969nM. Assay description: Data Source: Sanford-Burnham Center for Chemical Genomics (SBCCG) Source Affiliation: Sanford-Burnham Medical Research Institute (SBMRI, San Diego, C...
In DepthDetails PCBioAssay
TargetCannabinoid receptor 2(Homo sapiens (Human))
Burnham Center For Chemical Genomics
Curated by PubChem BioAssay
LigandPNGBDBM61147(MLS001079048 | N-(2-isopropoxy-5-morpholinosulfony...)
Affinity DataEC50: >3.20E+4nM. Assay description: Data Source: Sanford-Burnham Center for Chemical Genomics Source Affiliation: Sanford-Burnham Medical Research Institute (SBMRI, San Diego, CA) Net...
In DepthDetails PCBioAssay
TargetCannabinoid receptor 2(Homo sapiens (Human))
Burnham Center For Chemical Genomics
Curated by PubChem BioAssay
LigandPNGBDBM61147(MLS001079048 | N-(2-isopropoxy-5-morpholinosulfony...)
Affinity DataIC50: >3.20E+4nM. Assay description: Data Source: Sanford-Burnham Center for Chemical Genomics Source Affiliation: Sanford-Burnham Medical Research Institute (SBMRI, San Diego, CA) Netw...
In DepthDetails PCBioAssay
TargetG-protein coupled receptor 35(Homo sapiens (Human))
Burnham Center For Chemical Genomics
Curated by PubChem BioAssay
LigandPNGBDBM61147(MLS001079048 | N-(2-isopropoxy-5-morpholinosulfony...)
Affinity DataIC50:  3.20E+4nM. Assay description: Data Source: Sanford-Burnham Center for Chemical Genomics Source Affiliation: Sanford-Burnham Medical Research Institute Network: NIH Molecular Lib...
In DepthDetails PCBioAssay